FreeBSD-main-amd64-test - Build #29804 - Still unstable

From: <jenkins-admin_at_FreeBSD.org>
Date: Sun, 25 Oct 2026 20:43:21 UTC
FreeBSD-main-amd64-test - Build #29804 (28ec7cb8712fde61107126c8ff174578d0ccdf79) - Still unstable

Build information: https://ci.FreeBSD.org/job/FreeBSD-main-amd64-test/29804/
Full change log: https://ci.FreeBSD.org/job/FreeBSD-main-amd64-test/29804/changes
Full build log: https://ci.FreeBSD.org/job/FreeBSD-main-amd64-test/29804/console

Status explanation:
"Unstable" - some tests are suspected being broken by the following changes
"Still Unstable" - the failing test cases have not been fixed by these
                   following changes and this is a notification to note that
                   these changes have not been fully tested by the CI system

Change summaries:
(Those commits are likely but not certainly responsible)

741197267eb5038351079e8e125c04d3401ebb16 by wosch:
manpages: Fix unusual Xr order

3f4743d657785dcc5b06ada4aefde225d6350b39 by wosch:
manpages: Fix unusual Xr order

44a5cf137230ea9c0fcb33fb2a03700be4efd365 by wosch:
manpages: Fix unusual Xr order

f7114dc7b7b6c2b1ae72a742fcd344e3ae39f876 by wosch:
manpages: Fix unusual Xr order

6a936d939b886fe3d777d33b0327987c3aa08f51 by dim:
Merge commit 4d7292e58078 from llvm-project (by Minsoo Choo):

28ec7cb8712fde61107126c8ff174578d0ccdf79 by dim:
Merge commit fd4113508a64 from llvm-project (by Minsoo Choo):



The failed test cases:

9 tests failed.
FAILED:  sys.netpfil.pf.igmp.py.TestIGMP::test_ip_opts

Error Message:
/usr/local/lib/python3.12/site-packages/scapy/packet.py:1985: AttributeError

FAILED:  sys.netpfil.pf.pfsync.bulk

Error Message:
state not found on synced host

FAILED:  sys.kern.ssl_sendfile.grow

Error Message:
Test case body timed out

FAILED:  sys.kern.ssl_sendfile.eagain_vs_eof

Error Message:
/usr/src/tests/sys/kern/ssl_sendfile.c:485: c.sbytes == -1 not met

FAILED:  sys.kern.ssl_sendfile.truncate

Error Message:
Test case body timed out

FAILED:  sbin.dhclient.functional.py.__test_cases_list__

Error Message:
Test case list wrote to stderr

FAILED:  sys.net.if_lagg_test.witness

Error Message:
Lock-order reversals involving if_lagg.c detected

FAILED:  sys.netinet.udp_bindings.connect_bound_socket_from_2address_jail

Error Message:
/usr/src/tests/sys/netinet/udp_bindings.c:244: connect(s, (struct sockaddr *)&sin, sizeof(sin)) == 0 not met

FAILED:  sys.netlink.netlink_socket.overflow

Error Message:
/usr/src/tests/sys/netlink/netlink_socket.c:146: send(fd, &hdr, sizeof(hdr), 0) == sizeof(hdr) not met