FreeBSD-main-amd64-test - Build #29795 - Still Unstable
Date: Sat, 24 Oct 2026 21:30:44 UTC
FreeBSD-main-amd64-test - Build #29795 (a3d1d4e88ae7435cfc32a886999dcde2173839cd) - Still Unstable
Build information: https://ci.FreeBSD.org/job/FreeBSD-main-amd64-test/29795/
Full change log: https://ci.FreeBSD.org/job/FreeBSD-main-amd64-test/29795/changes
Full build log: https://ci.FreeBSD.org/job/FreeBSD-main-amd64-test/29795/console
Status explanation:
"Unstable" - some tests are suspected being broken by the following changes
"Still Unstable" - the failing test cases have not been fixed by these
following changes and this is a notification to note that
these changes have not been fully tested by the CI system
Change summaries:
(Those commits are likely but not certainly responsible)
9a8d5af1ba0174ec5fcc3eedba545aec9a627987 by kib:
linux: correct errors from mremap(2)
a3d1d4e88ae7435cfc32a886999dcde2173839cd by kib:
arm64 linux: Allow FUTEX_REQUEUE on arm64 by setting the brand flag
The failed test cases:
11 tests failed.
FAILED: sys.netinet6.ndp.ndp_prefix_lifetime
Error Message:
atf-check failed; see the output of the test for details
FAILED: sys.netpfil.pf.igmp.py.TestIGMP::test_ip_opts
Error Message:
/usr/local/lib/python3.12/site-packages/scapy/packet.py:1985: AttributeError
FAILED: sys.netpfil.pf.pfsync.bulk
Error Message:
state not found on synced host
FAILED: sys.kern.ssl_sendfile.grow
Error Message:
Test case body timed out
FAILED: sys.kern.ssl_sendfile.eagain_vs_eof
Error Message:
/usr/src/tests/sys/kern/ssl_sendfile.c:485: c.sbytes == -1 not met
FAILED: sys.kern.ssl_sendfile.truncate
Error Message:
Test case body timed out
FAILED: sbin.dhclient.functional.py.__test_cases_list__
Error Message:
Test case list wrote to stderr
FAILED: lib.libexecinfo.sigtramp_test.test_backtrace_sigtramp
Error Message:
/usr/src/lib/libexecinfo/tests/sigtramp_test.c:30: n > 1 not met
FAILED: sys.net.if_lagg_test.witness
Error Message:
Lock-order reversals involving if_lagg.c detected
FAILED: sys.netinet.udp_bindings.connect_bound_socket_from_2address_jail
Error Message:
/usr/src/tests/sys/netinet/udp_bindings.c:244: connect(s, (struct sockaddr *)&sin, sizeof(sin)) == 0 not met
FAILED: sys.netlink.netlink_socket.overflow
Error Message:
/usr/src/tests/sys/netlink/netlink_socket.c:146: send(fd, &hdr, sizeof(hdr), 0) == sizeof(hdr) not met