FreeBSD-main-amd64-test - Build #29793 - Still Unstable
Date: Sat, 24 Oct 2026 16:27:59 UTC
FreeBSD-main-amd64-test - Build #29793 (10ceddaa94d5b234dde897a3eb90ca57700636d8) - Still Unstable
Build information: https://ci.FreeBSD.org/job/FreeBSD-main-amd64-test/29793/
Full change log: https://ci.FreeBSD.org/job/FreeBSD-main-amd64-test/29793/changes
Full build log: https://ci.FreeBSD.org/job/FreeBSD-main-amd64-test/29793/console
Status explanation:
"Unstable" - some tests are suspected being broken by the following changes
"Still Unstable" - the failing test cases have not been fixed by these
following changes and this is a notification to note that
these changes have not been fully tested by the CI system
Change summaries:
(Those commits are likely but not certainly responsible)
13011cbf7d80cd1554d87296225ceccb3f7524b4 by emaste:
smsc: Remove phy address check in smsc_miibus_writereg
dc4c75c9a3c3611af451da13990e49e267551475 by emaste:
smsc: Support external PHY
10ceddaa94d5b234dde897a3eb90ca57700636d8 by emaste:
smsc: Use read-modify-write to configure LEDs
The failed test cases:
9 tests failed.
FAILED: sys.netpfil.pf.pfsync.bulk
Error Message:
state not found on synced host
FAILED: sys.kern.ssl_sendfile.grow
Error Message:
Test case body timed out
FAILED: sys.kern.ssl_sendfile.eagain_vs_eof
Error Message:
/usr/src/tests/sys/kern/ssl_sendfile.c:485: c.sbytes == -1 not met
FAILED: sys.kern.ssl_sendfile.truncate
Error Message:
Test case body timed out
FAILED: sbin.dhclient.functional.py.__test_cases_list__
Error Message:
Test case list wrote to stderr
FAILED: lib.libexecinfo.sigtramp_test.test_backtrace_sigtramp
Error Message:
/usr/src/lib/libexecinfo/tests/sigtramp_test.c:30: n > 1 not met
FAILED: sys.net.if_lagg_test.witness
Error Message:
Lock-order reversals involving if_lagg.c detected
FAILED: sys.netinet.udp_bindings.connect_bound_socket_from_2address_jail
Error Message:
/usr/src/tests/sys/netinet/udp_bindings.c:244: connect(s, (struct sockaddr *)&sin, sizeof(sin)) == 0 not met
FAILED: sys.netlink.netlink_socket.overflow
Error Message:
/usr/src/tests/sys/netlink/netlink_socket.c:146: send(fd, &hdr, sizeof(hdr), 0) == sizeof(hdr) not met