FreeBSD-main-amd64-test - Build #29782 - Still Unstable
Date: Fri, 23 Oct 2026 16:02:26 UTC
FreeBSD-main-amd64-test - Build #29782 (da04cf02c96b97c587580b336fa527392467f689) - Still Unstable
Build information: https://ci.FreeBSD.org/job/FreeBSD-main-amd64-test/29782/
Full change log: https://ci.FreeBSD.org/job/FreeBSD-main-amd64-test/29782/changes
Full build log: https://ci.FreeBSD.org/job/FreeBSD-main-amd64-test/29782/console
Status explanation:
"Unstable" - some tests are suspected being broken by the following changes
"Still Unstable" - the failing test cases have not been fixed by these
following changes and this is a notification to note that
these changes have not been fully tested by the CI system
Change summaries:
(Those commits are likely but not certainly responsible)
38407c46ded957a2ecb7fe2a0dca6c4ac8e802f3 by cperciva:
mkimg: Use reallocf
e7f84fe6cfac2de3471e4912b1ac82023976ccfa by cperciva:
mkimg: Don't ignore invalid partition offsets
729883c93e7fd89a4b88e8b9a7ef42938a431efa by cperciva:
mkimg: Add per-partition alignment
b063ea64c72e075f593d0429739881df304ccd56 by cperciva:
mkimg.1: Document new %align mechanism
1485ee74f81039cfdccd294440813a1a2badfc0b by cperciva:
mkimg: Remove duplicate variable assignment
0f787e867d217583017181d1a904933939b4c34d by cperciva:
__FreeBSD_version: Bump for mkimg %align feature
f46269aba8a0bc2b60a0305bdafd8dfb42e0bb88 by cperciva:
vmimage.subr: Support partition alignment
5774911bfb304c2c9b5d6c3c798c21e2c40b59de by cperciva:
EC2: Align partitions to 1 MB boundaries
da04cf02c96b97c587580b336fa527392467f689 by cperciva:
mkimg: Ignore redundant %align values
The failed test cases:
10 tests failed.
FAILED: sys.kern.ssl_sendfile.grow
Error Message:
Test case body timed out
FAILED: sys.netpfil.pf.pfsync.bulk
Error Message:
state not found on synced host
FAILED: sys.netpfil.pf.syncookie.basic_v6
Error Message:
Failed to connect to syncookie protected echo daemon
FAILED: sys.kern.ssl_sendfile.eagain_vs_eof
Error Message:
/usr/src/tests/sys/kern/ssl_sendfile.c:485: c.sbytes == -1 not met
FAILED: sys.kern.ssl_sendfile.truncate
Error Message:
Test case body timed out
FAILED: sbin.dhclient.functional.py.__test_cases_list__
Error Message:
Test case list wrote to stderr
FAILED: lib.libexecinfo.sigtramp_test.test_backtrace_sigtramp
Error Message:
/usr/src/lib/libexecinfo/tests/sigtramp_test.c:30: n > 1 not met
FAILED: sys.net.if_lagg_test.witness
Error Message:
Lock-order reversals involving if_lagg.c detected
FAILED: sys.netinet.udp_bindings.connect_bound_socket_from_2address_jail
Error Message:
/usr/src/tests/sys/netinet/udp_bindings.c:244: connect(s, (struct sockaddr *)&sin, sizeof(sin)) == 0 not met
FAILED: sys.netlink.netlink_socket.overflow
Error Message:
/usr/src/tests/sys/netlink/netlink_socket.c:146: send(fd, &hdr, sizeof(hdr), 0) == sizeof(hdr) not met