FreeBSD-stable-15-amd64-test - Build #1211 - Still Unstable
Date: Fri, 23 Oct 2026 07:41:23 UTC
FreeBSD-stable-15-amd64-test - Build #1211 (c3f6fef402d7384b11cdfe613ac0fe158f9039aa) - Still Unstable
Build information: https://ci.FreeBSD.org/job/FreeBSD-stable-15-amd64-test/1211/
Full change log: https://ci.FreeBSD.org/job/FreeBSD-stable-15-amd64-test/1211/changes
Full build log: https://ci.FreeBSD.org/job/FreeBSD-stable-15-amd64-test/1211/console
Status explanation:
"Unstable" - some tests are suspected being broken by the following changes
"Still Unstable" - the failing test cases have not been fixed by these
following changes and this is a notification to note that
these changes have not been fully tested by the CI system
Change summaries:
(Those commits are likely but not certainly responsible)
4a6f371902a944e7c66001bd6bbf0cd81611dd8e by kib:
machine/floatingpoing.h: harmonize all arches
a401023a0263ca0681429ac614a162ca0dd36e08 by kib:
linux: preserve epoll descriptors across fork using KQUEUE_CPONFORK
c3f6fef402d7384b11cdfe613ac0fe158f9039aa by kib:
sysarch.x86.2: manual page for the sysarch(2) functions on x86
The failed test cases:
3 tests failed.
FAILED: sys.netpfil.pf.igmp.py.TestIGMP::test_ip_opts
Error Message:
/usr/local/lib/python3.12/site-packages/scapy/packet.py:1985: AttributeError
FAILED: sys.netpfil.pf.pfsync.bulk
Error Message:
state not found on synced host
FAILED: lib.libexecinfo.sigtramp_test.test_backtrace_sigtramp
Error Message:
/usr/src/lib/libexecinfo/tests/sigtramp_test.c:30: n > 1 not met