FreeBSD-main-amd64-test - Build #29778 - Still Unstable

From: <jenkins-admin_at_FreeBSD.org>
Date: Fri, 23 Oct 2026 04:52:47 UTC
FreeBSD-main-amd64-test - Build #29778 (8dfa23d81f5e0969ac31c34279201f9286358e44) - Still Unstable

Build information: https://ci.FreeBSD.org/job/FreeBSD-main-amd64-test/29778/
Full change log: https://ci.FreeBSD.org/job/FreeBSD-main-amd64-test/29778/changes
Full build log: https://ci.FreeBSD.org/job/FreeBSD-main-amd64-test/29778/console

Status explanation:
"Unstable" - some tests are suspected being broken by the following changes
"Still Unstable" - the failing test cases have not been fixed by these
                   following changes and this is a notification to note that
                   these changes have not been fully tested by the CI system

Change summaries:
(Those commits are likely but not certainly responsible)

2d6f961164e4ab7e823972336dc9cfaae6a88ed8 by emaste:
ssh: use defaultkey sentinel for ML-DSA-44 default host key

40582412d3fc6c68bb5c90fa7878998ba7f799e3 by kib:
x86/mp_x86.c: unbreak COUNT_IPIS

dca0b0ad8bc7df6119b04d1b766289406e3274a3 by kib:
sys/sysent.h: align SV_* flags values, provide full 32bit

f69d974bf6d2f7ccaa3e6a5f9609cfca0d66ec8d by kib:
sys: centralize SV_* flags definitions for several FreeBSD ABIs

8dfa23d81f5e0969ac31c34279201f9286358e44 by kib:
sys: centralize SV_* flags definitions for ELF Linux ABIs



The failed test cases:

11 tests failed.
FAILED:  sys.netpfil.pf.igmp.py.TestIGMP::test_ip_opts

Error Message:
/usr/local/lib/python3.12/site-packages/scapy/packet.py:1985: AttributeError

FAILED:  sys.netpfil.pf.pfsync.bulk

Error Message:
state not found on synced host

FAILED:  sys.netpfil.pf.syncookie.basic_v6

Error Message:
Failed to connect to syncookie protected echo daemon

FAILED:  sys.kern.ssl_sendfile.eagain_vs_eof

Error Message:
/usr/src/tests/sys/kern/ssl_sendfile.c:485: c.sbytes == -1 not met

FAILED:  sys.kern.ssl_sendfile.grow

Error Message:
Test case body timed out

FAILED:  sys.kern.ssl_sendfile.truncate

Error Message:
Test case body timed out

FAILED:  sbin.dhclient.functional.py.__test_cases_list__

Error Message:
Test case list wrote to stderr

FAILED:  lib.libexecinfo.sigtramp_test.test_backtrace_sigtramp

Error Message:
/usr/src/lib/libexecinfo/tests/sigtramp_test.c:30: n > 1 not met

FAILED:  sys.net.if_lagg_test.witness

Error Message:
Lock-order reversals involving if_lagg.c detected

FAILED:  sys.netinet.udp_bindings.connect_bound_socket_from_2address_jail

Error Message:
/usr/src/tests/sys/netinet/udp_bindings.c:244: connect(s, (struct sockaddr *)&sin, sizeof(sin)) == 0 not met

FAILED:  sys.netlink.netlink_socket.overflow

Error Message:
/usr/src/tests/sys/netlink/netlink_socket.c:146: send(fd, &hdr, sizeof(hdr), 0) == sizeof(hdr) not met