FreeBSD-main-amd64-test - Build #29767 - Still Unstable
Date: Thu, 22 Oct 2026 01:55:10 UTC
FreeBSD-main-amd64-test - Build #29767 (93c05b743ea865bb87653e9ee5fbaa837c00eee7) - Still Unstable
Build information: https://ci.FreeBSD.org/job/FreeBSD-main-amd64-test/29767/
Full change log: https://ci.FreeBSD.org/job/FreeBSD-main-amd64-test/29767/changes
Full build log: https://ci.FreeBSD.org/job/FreeBSD-main-amd64-test/29767/console
Status explanation:
"Unstable" - some tests are suspected being broken by the following changes
"Still Unstable" - the failing test cases have not been fixed by these
following changes and this is a notification to note that
these changes have not been fully tested by the CI system
Change summaries:
(Those commits are likely but not certainly responsible)
93c05b743ea865bb87653e9ee5fbaa837c00eee7 by cperciva:
OCI: Remove dead code
The failed test cases:
9 tests failed.
FAILED: sys.kern.ssl_sendfile.eagain_vs_eof
Error Message:
/usr/src/tests/sys/kern/ssl_sendfile.c:485: c.sbytes == -1 not met
FAILED: sys.kern.ssl_sendfile.grow
Error Message:
Test case body timed out
FAILED: sys.kern.ssl_sendfile.truncate
Error Message:
Test case body timed out
FAILED: sbin.dhclient.functional.py.__test_cases_list__
Error Message:
Test case list wrote to stderr
FAILED: usr.bin.diff.diff_test.conflicting_format
Error Message:
atf-check failed; see the output of the test for details
FAILED: lib.libexecinfo.sigtramp_test.test_backtrace_sigtramp
Error Message:
/usr/src/lib/libexecinfo/tests/sigtramp_test.c:30: n > 1 not met
FAILED: sys.net.if_lagg_test.witness
Error Message:
Lock-order reversals involving if_lagg.c detected
FAILED: sys.netinet.udp_bindings.connect_bound_socket_from_2address_jail
Error Message:
/usr/src/tests/sys/netinet/udp_bindings.c:244: connect(s, (struct sockaddr *)&sin, sizeof(sin)) == 0 not met
FAILED: sys.netlink.netlink_socket.overflow
Error Message:
/usr/src/tests/sys/netlink/netlink_socket.c:146: send(fd, &hdr, sizeof(hdr), 0) == sizeof(hdr) not met