FreeBSD-main-amd64-test - Build #29757 - Still Unstable

From: <jenkins-admin_at_FreeBSD.org>
Date: Wed, 21 Oct 2026 00:15:14 UTC
FreeBSD-main-amd64-test - Build #29757 (ee96770ee37591d5fc9f7ee39aa1386636e8dc8d) - Still Unstable

Build information: https://ci.FreeBSD.org/job/FreeBSD-main-amd64-test/29757/
Full change log: https://ci.FreeBSD.org/job/FreeBSD-main-amd64-test/29757/changes
Full build log: https://ci.FreeBSD.org/job/FreeBSD-main-amd64-test/29757/console

Status explanation:
"Unstable" - some tests are suspected being broken by the following changes
"Still Unstable" - the failing test cases have not been fixed by these
                   following changes and this is a notification to note that
                   these changes have not been fully tested by the CI system

Change summaries:
(Those commits are likely but not certainly responsible)

5258b44e845a7ccdc3e07a9244e77dc100feedca by imp:
nvme: add a timeout for Format NVM commands

1c31ef40e185a09c030d53640f6ebc71bb0c830f by imp:
nvme: support per-request timeouts

15cd8528b1964e646ed8d2282c42f5fe00b72ed2 by imp:
nvme: honor Linux passthrough command timeouts

66c24c94323ae36f2132c60bc2788ab70b60f224 by imp:
nvme: Refactor namespace notifications for additions

e65ccec8c0e359f584b2948c100ee3012e43c6e7 by imp:
nvme: Notify namespaces on reset sometimes

4623bbfe7bfc81d2626a5c2a7a5cfb2ff15c0360 by imp:
nvmecontrol: select format by sector size

b991e2dd824cc6a120a346a183837875ff75b66d by imp:
nvmecontrol: support controller-wide sector sizes

3b66efc6e9b8999053f11a449056fad5ebc1c1ac by imp:
nvmecontrol: add format dry-run support

bf3726998fc7655fa116dd99be24842407d8263b by imp:
nvmecontrol: Use admin device for admin-passthru

ee96770ee37591d5fc9f7ee39aa1386636e8dc8d by imp:
nvmecontrol: Fix mixup between pi and pil



The failed test cases:

9 tests failed.
FAILED:  sys.kern.ssl_sendfile.eagain_vs_eof

Error Message:
/usr/src/tests/sys/kern/ssl_sendfile.c:485: c.sbytes == -1 not met

FAILED:  sys.kern.ssl_sendfile.grow

Error Message:
Test case body timed out

FAILED:  sys.kern.ssl_sendfile.truncate

Error Message:
Test case body timed out

FAILED:  sbin.dhclient.functional.py.__test_cases_list__

Error Message:
Test case list wrote to stderr

FAILED:  usr.bin.diff.diff_test.conflicting_format

Error Message:
atf-check failed; see the output of the test for details

FAILED:  lib.libexecinfo.sigtramp_test.test_backtrace_sigtramp

Error Message:
/usr/src/lib/libexecinfo/tests/sigtramp_test.c:30: n > 1 not met

FAILED:  sys.net.if_lagg_test.witness

Error Message:
Lock-order reversals involving if_lagg.c detected

FAILED:  sys.netinet.udp_bindings.connect_bound_socket_from_2address_jail

Error Message:
/usr/src/tests/sys/netinet/udp_bindings.c:244: connect(s, (struct sockaddr *)&sin, sizeof(sin)) == 0 not met

FAILED:  sys.netlink.netlink_socket.overflow

Error Message:
/usr/src/tests/sys/netlink/netlink_socket.c:146: send(fd, &hdr, sizeof(hdr), 0) == sizeof(hdr) not met