FreeBSD-main-amd64-gcc14_build - Build #5002 - Still Failing
Date: Tue, 20 Oct 2026 17:25:06 UTC
FreeBSD-main-amd64-gcc14_build - Build #5002 (0ce9d6e240a14d5b7cd8eb45a83d0e429f4a3edf) - Still Failing
Build information: https://ci.FreeBSD.org/job/FreeBSD-main-amd64-gcc14_build/5002/
Full change log: https://ci.FreeBSD.org/job/FreeBSD-main-amd64-gcc14_build/5002/changes
Full build log: https://ci.FreeBSD.org/job/FreeBSD-main-amd64-gcc14_build/5002/console
Status explanation:
"Failure" - the build is suspected being broken by the following changes
"Still Failing" - the build has not been fixed by the following changes and
this is a notification to note that these changes have
not been fully tested by the CI system
Change summaries:
(Those commits are likely but not certainly responsible)
4f19e4aca4f4b7a3058be5d3bfc5aed66668b00f by des:
auditdistd: Use void pointers for opaque data
a5e6bee5a0bff9e9c12037e0b2c76c4f2ab5e046 by des:
hastd: Use void pointers for opaque data
8430de47aa7c004e1330b8f6a3018c360425606e by kevans:
wg: fix the LINT-NOIP build
dff56e8118985248678e1a6916cdefd708a9d85f by des:
hastd: Fix build failure
0ce9d6e240a14d5b7cd8eb45a83d0e429f4a3edf by des:
auditdistd: Fix build failure
The end of the build log:
[...truncated 90.64 MiB...]
/workspace/src/sbin/init/init.c: In function 'run_script':
/workspace/src/sbin/init/init.c:1208:24: warning: cast between incompatible function types from 'long int (* (*)(void))(void)' to 'long int (*)(void)' [-Wcast-function-type]
1208 | return (state_func_t) single_user;
| ^
/workspace/src/sbin/init/init.c:1220:32: warning: cast between incompatible function types from 'state_t' {aka 'long int (* (*)(void))(void)'} to 'long int (*)(void)' [-Wcast-function-type]
1220 | return (state_func_t) requested_transition;
| ^
/workspace/src/sbin/init/init.c:1226:32: warning: cast between incompatible function types from 'long int (* (*)(void))(void)' to 'long int (*)(void)' [-Wcast-function-type]
1226 | return (state_func_t) single_user;
| ^
/workspace/src/sbin/init/init.c:1249:24: warning: cast between incompatible function types from 'long int (* (*)(void))(void)' to 'long int (*)(void)' [-Wcast-function-type]
1249 | return (state_func_t) single_user;
| ^
/workspace/src/sbin/init/init.c:1253:24: warning: cast between incompatible function types from 'long int (* (*)(void))(void)' to 'long int (*)(void)' [-Wcast-function-type]
1253 | return (state_func_t) single_user;
| ^
/workspace/src/sbin/init/init.c: In function 'read_ttys':
/workspace/src/sbin/init/init.c:1480:24: warning: cast between incompatible function types from 'long int (* (*)(void))(void)' to 'long int (*)(void)' [-Wcast-function-type]
1480 | return (state_func_t) single_user;
| ^
/workspace/src/sbin/init/init.c:1492:16: warning: cast between incompatible function types from 'long int (* (*)(void))(void)' to 'long int (*)(void)' [-Wcast-function-type]
1492 | return (state_func_t) multi_user;
| ^
/workspace/src/sbin/init/init.c: In function 'multi_user':
/workspace/src/sbin/init/init.c:1821:16: warning: cast between incompatible function types from 'state_t' {aka 'long int (* (*)(void))(void)'} to 'long int (*)(void)' [-Wcast-function-type]
1821 | return (state_func_t) requested_transition;
| ^
/workspace/src/sbin/init/init.c: In function 'clean_ttys':
/workspace/src/sbin/init/init.c:1907:16: warning: cast between incompatible function types from 'long int (* (*)(void))(void)' to 'long int (*)(void)' [-Wcast-function-type]
1907 | return (state_func_t) multi_user;
| ^
/workspace/src/sbin/init/init.c: In function 'catatonia':
/workspace/src/sbin/init/init.c:1921:16: warning: cast between incompatible function types from 'long int (* (*)(void))(void)' to 'long int (*)(void)' [-Wcast-function-type]
1921 | return (state_func_t) multi_user;
| ^
/workspace/src/sbin/init/init.c: In function 'death':
/workspace/src/sbin/init/init.c:1967:16: warning: cast between incompatible function types from 'long int (* (*)(void))(void)' to 'long int (*)(void)' [-Wcast-function-type]
1967 | return (state_func_t) death_single;
| ^
/workspace/src/sbin/init/init.c: In function 'death_single':
/workspace/src/sbin/init/init.c:1986:32: warning: cast between incompatible function types from 'long int (* (*)(void))(void)' to 'long int (*)(void)' [-Wcast-function-type]
1986 | return (state_func_t) single_user;
| ^
/workspace/src/sbin/init/init.c:1996:32: warning: cast between incompatible function types from 'long int (* (*)(void))(void)' to 'long int (*)(void)' [-Wcast-function-type]
1996 | return (state_func_t) single_user;
| ^
/workspace/src/sbin/init/init.c:2001:16: warning: cast between incompatible function types from 'long int (* (*)(void))(void)' to 'long int (*)(void)' [-Wcast-function-type]
2001 | return (state_func_t) single_user;
| ^
/workspace/src/sbin/init/init.c: In function 'transition_handler':
/workspace/src/sbin/init/init.c:1746:23: warning: this statement may fall through [-Wimplicit-fallthrough=]
1746 | howto = RB_POWEROFF;
| ^
/workspace/src/sbin/init/init.c:1747:9: note: here
1747 | case SIGUSR1:
| ^~~~
/workspace/src/sbin/init/init.c:1748:23: warning: this statement may fall through [-Wimplicit-fallthrough=]
1748 | howto |= RB_HALT;
| ^
/workspace/src/sbin/init/init.c:1749:9: note: here
1749 | case SIGWINCH:
| ^~~~
/workspace/src/sbin/init/init.c:1753:24: warning: this statement may fall through [-Wimplicit-fallthrough=]
1753 | Reboot = true;
| ^
/workspace/src/sbin/init/init.c:1754:9: note: here
1754 | case SIGTERM:
| ^~~~
--- all_subdir_stand ---
--- module.o ---
/usr/local/bin/x86_64-unknown-freebsd15.1-gcc14 --sysroot=/tmp/obj/workspace/src/amd64.amd64/tmp -B/usr/local/x86_64-unknown-freebsd15.1/bin/ -O2 -pipe -fno-common -I/workspace/src/stand/i386/btx/lib -nostdinc -I/tmp/obj/workspace/src/amd64.amd64/stand/libsa32 -I/workspace/src/stand/libsa -D_STANDALONE -I/workspace/src/sys -Ddouble=jagged-little-pill -Dfloat=floaty-mcfloatface -ffunction-sections -fdata-sections -DLOADER_GELI_SUPPORT -I/workspace/src/stand/libsa/geli -DLOADER_DISK_SUPPORT -DLOADER_NET_SUPPORT -DLOADER_MD_SUPPORT -m32 -ffreestanding -mno-mmx -mno-sse -msoft-float -march=i386 -I. -Iinclude -I/workspace/src/stand/common -I/workspace/src/stand/ficl -I/workspace/src/stand/ficl/i386 -I/workspace/src/stand/common -DBF_DICTSIZE=30000 -DLOADER_CD9660_SUPPORT -DLOADER_UFS_SUPPORT -DLOADER_GZIP_SUPPORT -DLOADER_BZIP2_SUPPORT -DLOADER_XZ_SUPPORT -DLOADER_NFS_SUPPORT -DLOADER_TFTP_SUPPORT -DLOADER_GPT_SUPPORT -DLOADER_MBR_SUPPORT -DLOADER_ZFS_SUPPORT -I/workspace/src/stand/libsa/zfs -I/workspace/src/sys/cddl/boot/zfs -I/workspace/src/sys/cddl/contrib/opensolaris/uts/common -DHELP_FILENAME=\"loader.help.bios\" -Wall -I/workspace/src/stand/i386 -DLOADER_PREFER_AMD64 -MD -MF.depend.module.o -MTmodule.o -std=gnu17 -Wno-format-zero-length -Wsystem-headers -Werror -Wno-pointer-sign -Wdate-time -Wno-error=address -Wno-error=array-bounds -Wno-error=attributes -Wno-error=bool-compare -Wno-error=cast-align -Wno-error=clobbered -Wno-error=deprecated-declarations -Wno-error=enum-compare -Wno-error=extra -Wno-error=logical-not-parentheses -Wno-error=strict-aliasing -Wno-error=uninitialized -Wno-error=unused-function -Wno-error=unused-value -Wno-error=empty-body -Wno-error=maybe-uninitialized -Wno-error=nonnull-compare -Wno-error=shift-negative-value -Wno-error=tautological-compare -Wno-error=unused-const-variable -Wno-error=bool-operation -Wno-error=deprecated -Wno-error=expansion-to-defined -Wno-error=format-overflow -Wno-error=format-truncation -Wno-error=implicit-fallthrough -Wno-error=int-in-bool-context -Wno-error=memset-elt-size -Wno-error=noexcept-type -Wno-error=nonnull -Wno-error=pointer-compare -Wno-error=stringop-overflow -Wno-error=aggressive-loop-optimizations -Wno-error=cast-function-type -Wno-error=catch-value -Wno-error=multistatement-macros -Wno-error=restrict -Wno-error=sizeof-pointer-memaccess -Wno-error=stringop-truncation -Wno-return-type -Wno-address-of-packed-member -Os -mpreferred-stack-boundary=2 -I/workspace/src/sys/teken -I/workspace/src/contrib/pnglite -c /workspace/src/stand/common/module.c -o module.o
/workspace/src/stand/common/module.c:1677:1: warning: 'file_remove' defined but not used [-Wunused-function]
1677 | file_remove(struct preloaded_file *fp)
| ^~~~~~~~~~~
--- all_subdir_sbin ---
--- format.pieo ---
/usr/local/bin/x86_64-unknown-freebsd15.1-gcc14 --sysroot=/tmp/obj/workspace/src/amd64.amd64/tmp -B/usr/local/x86_64-unknown-freebsd15.1/bin/ -fpie -DPIC -O2 -pipe -fno-common -I/workspace/src/lib/libnvmf -fPIE -g -MD -MF.depend.format.pieo -MTformat.pieo -std=gnu17 -Wno-format-zero-length -fstack-protector-strong -Wsystem-headers -Werror -Wall -Wno-format-y2k -W -Wno-unused-parameter -Wmissing-prototypes -Wpointer-arith -Wreturn-type -Wcast-qual -Wwrite-strings -Wswitch -Wshadow -Wunused-parameter -Wcast-align -Wchar-subscripts -Wnested-externs -Wold-style-definition -Wno-pointer-sign -Wdate-time -Wno-error=address -Wno-error=array-bounds -Wno-error=attributes -Wno-error=bool-compare -Wno-error=cast-align -Wno-error=clobbered -Wno-error=deprecated-declarations -Wno-error=enum-compare -Wno-error=extra -Wno-error=logical-not-parentheses -Wno-error=strict-aliasing -Wno-error=uninitialized -Wno-error=unused-function -Wno-error=unused-value -Wno-error=empty-body -Wno-error=maybe-uninitialized -Wno-error=nonnull-compare -Wno-error=shift-negative-value -Wno-error=tautological-compare -Wno-error=unused-const-variable -Wno-error=bool-operation -Wno-error=deprecated -Wno-error=expansion-to-defined -Wno-error=format-overflow -Wno-error=format-truncation -Wno-error=implicit-fallthrough -Wno-error=int-in-bool-context -Wno-error=memset-elt-size -Wno-error=noexcept-type -Wno-error=nonnull -Wno-error=pointer-compare -Wno-error=stringop-overflow -Wno-error=aggressive-loop-optimizations -Wno-error=cast-function-type -Wno-error=catch-value -Wno-error=multistatement-macros -Wno-error=restrict -Wno-error=sizeof-pointer-memaccess -Wno-error=stringop-truncation -Wno-return-type -c /workspace/src/sbin/nvmecontrol/format.c -o format.pieo
--- all_subdir_stand ---
--- all_subdir_stand/efi ---
--- strdup.o ---
/usr/local/bin/x86_64-unknown-freebsd15.1-gcc14 --sysroot=/tmp/obj/workspace/src/amd64.amd64/tmp -B/usr/local/x86_64-unknown-freebsd15.1/bin/ -O2 -pipe -fno-common -Wformat -fshort-wchar -mno-red-zone -malign-double -nostdinc -I/tmp/obj/workspace/src/amd64.amd64/stand/libsa32 -I/workspace/src/stand/libsa -D_STANDALONE -I/workspace/src/sys -Ddouble=jagged-little-pill -Dfloat=floaty-mcfloatface -ffunction-sections -fdata-sections -DLOADER_GELI_SUPPORT -I/workspace/src/stand/libsa/geli -DLOADER_DISK_SUPPORT -m32 -ffreestanding -mno-mmx -mno-sse -msoft-float -march=i386 -I. -Iinclude -g -MD -MF.depend.strdup.o -MTstrdup.o -std=gnu17 -Wno-format-zero-length -Wsystem-headers -Werror -Wno-pointer-sign -Wdate-time -Wno-error=address -Wno-error=array-bounds -Wno-error=attributes -Wno-error=bool-compare -Wno-error=cast-align -Wno-error=clobbered -Wno-error=deprecated-declarations -Wno-error=enum-compare -Wno-error=extra -Wno-error=logical-not-parentheses -Wno-error=strict-aliasing -Wno-error=uninitialized -Wno-error=unused-function -Wno-error=unused-value -Wno-error=empty-body -Wno-error=maybe-uninitialized -Wno-error=nonnull-compare -Wno-error=shift-negative-value -Wno-error=tautological-compare -Wno-error=unused-const-variable -Wno-error=bool-operation -Wno-error=deprecated -Wno-error=expansion-to-defined -Wno-error=format-overflow -Wno-error=format-truncation -Wno-error=implicit-fallthrough -Wno-error=int-in-bool-context -Wno-error=memset-elt-size -Wno-error=noexcept-type -Wno-error=nonnull -Wno-error=pointer-compare -Wno-error=stringop-overflow -Wno-error=aggressive-loop-optimizations -Wno-error=cast-function-type -Wno-error=catch-value -Wno-error=multistatement-macros -Wno-error=restrict -Wno-error=sizeof-pointer-memaccess -Wno-error=stringop-truncation -Wno-return-type -Wno-address-of-packed-member -Os -mpreferred-stack-boundary=2 -c /workspace/src/stand/libsa/strdup.c -o strdup.o
--- all_subdir_sbin ---
/workspace/src/sbin/nvmecontrol/format.c: In function 'find_lbaf':
/workspace/src/sbin/nvmecontrol/format.c:132:60: error: comparison of integer expressions of different signedness: 'uint32_t' {aka 'unsigned int'} and 'int' [-Werror=sign-compare]
132 | if (NVMEV(NVME_NS_DATA_LBAF_LBADS, format) != lbads ||
| ^~
--- all_subdir_stand ---
--- strerror.o ---
/usr/local/bin/x86_64-unknown-freebsd15.1-gcc14 --sysroot=/tmp/obj/workspace/src/amd64.amd64/tmp -B/usr/local/x86_64-unknown-freebsd15.1/bin/ -O2 -pipe -fno-common -Wformat -fshort-wchar -mno-red-zone -malign-double -nostdinc -I/tmp/obj/workspace/src/amd64.amd64/stand/libsa32 -I/workspace/src/stand/libsa -D_STANDALONE -I/workspace/src/sys -Ddouble=jagged-little-pill -Dfloat=floaty-mcfloatface -ffunction-sections -fdata-sections -DLOADER_GELI_SUPPORT -I/workspace/src/stand/libsa/geli -DLOADER_DISK_SUPPORT -m32 -ffreestanding -mno-mmx -mno-sse -msoft-float -march=i386 -I. -Iinclude -g -MD -MF.depend.strerror.o -MTstrerror.o -std=gnu17 -Wno-format-zero-length -Wsystem-headers -Werror -Wno-pointer-sign -Wdate-time -Wno-error=address -Wno-error=array-bounds -Wno-error=attributes -Wno-error=bool-compare -Wno-error=cast-align -Wno-error=clobbered -Wno-error=deprecated-declarations -Wno-error=enum-compare -Wno-error=extra -Wno-error=logical-not-parentheses -Wno-error=strict-aliasing -Wno-error=uninitialized -Wno-error=unused-function -Wno-error=unused-value -Wno-error=empty-body -Wno-error=maybe-uninitialized -Wno-error=nonnull-compare -Wno-error=shift-negative-value -Wno-error=tautological-compare -Wno-error=unused-const-variable -Wno-error=bool-operation -Wno-error=deprecated -Wno-error=expansion-to-defined -Wno-error=format-overflow -Wno-error=format-truncation -Wno-error=implicit-fallthrough -Wno-error=int-in-bool-context -Wno-error=memset-elt-size -Wno-error=noexcept-type -Wno-error=nonnull -Wno-error=pointer-compare -Wno-error=stringop-overflow -Wno-error=aggressive-loop-optimizations -Wno-error=cast-function-type -Wno-error=catch-value -Wno-error=multistatement-macros -Wno-error=restrict -Wno-error=sizeof-pointer-memaccess -Wno-error=stringop-truncation -Wno-return-type -Wno-address-of-packed-member -Os -mpreferred-stack-boundary=2 -c /workspace/src/stand/libsa/strerror.c -o strerror.o
--- random.o ---
/usr/local/bin/x86_64-unknown-freebsd15.1-gcc14 --sysroot=/tmp/obj/workspace/src/amd64.amd64/tmp -B/usr/local/x86_64-unknown-freebsd15.1/bin/ -O2 -pipe -fno-common -Wformat -fshort-wchar -mno-red-zone -malign-double -nostdinc -I/tmp/obj/workspace/src/amd64.amd64/stand/libsa32 -I/workspace/src/stand/libsa -D_STANDALONE -I/workspace/src/sys -Ddouble=jagged-little-pill -Dfloat=floaty-mcfloatface -ffunction-sections -fdata-sections -DLOADER_GELI_SUPPORT -I/workspace/src/stand/libsa/geli -DLOADER_DISK_SUPPORT -m32 -ffreestanding -mno-mmx -mno-sse -msoft-float -march=i386 -I. -Iinclude -g -MD -MF.depend.random.o -MTrandom.o -std=gnu17 -Wno-format-zero-length -Wsystem-headers -Werror -Wno-pointer-sign -Wdate-time -Wno-error=address -Wno-error=array-bounds -Wno-error=attributes -Wno-error=bool-compare -Wno-error=cast-align -Wno-error=clobbered -Wno-error=deprecated-declarations -Wno-error=enum-compare -Wno-error=extra -Wno-error=logical-not-parentheses -Wno-error=strict-aliasing -Wno-error=uninitialized -Wno-error=unused-function -Wno-error=unused-value -Wno-error=empty-body -Wno-error=maybe-uninitialized -Wno-error=nonnull-compare -Wno-error=shift-negative-value -Wno-error=tautological-compare -Wno-error=unused-const-variable -Wno-error=bool-operation -Wno-error=deprecated -Wno-error=expansion-to-defined -Wno-error=format-overflow -Wno-error=format-truncation -Wno-error=implicit-fallthrough -Wno-error=int-in-bool-context -Wno-error=memset-elt-size -Wno-error=noexcept-type -Wno-error=nonnull -Wno-error=pointer-compare -Wno-error=stringop-overflow -Wno-error=aggressive-loop-optimizations -Wno-error=cast-function-type -Wno-error=catch-value -Wno-error=multistatement-macros -Wno-error=restrict -Wno-error=sizeof-pointer-memaccess -Wno-error=stringop-truncation -Wno-return-type -Wno-address-of-packed-member -Os -mpreferred-stack-boundary=2 -c /workspace/src/stand/libsa/random.c -o random.o
--- sbrk.o ---
/usr/local/bin/x86_64-unknown-freebsd15.1-gcc14 --sysroot=/tmp/obj/workspace/src/amd64.amd64/tmp -B/usr/local/x86_64-unknown-freebsd15.1/bin/ -O2 -pipe -fno-common -Wformat -fshort-wchar -mno-red-zone -malign-double -nostdinc -I/tmp/obj/workspace/src/amd64.amd64/stand/libsa32 -I/workspace/src/stand/libsa -D_STANDALONE -I/workspace/src/sys -Ddouble=jagged-little-pill -Dfloat=floaty-mcfloatface -ffunction-sections -fdata-sections -DLOADER_GELI_SUPPORT -I/workspace/src/stand/libsa/geli -DLOADER_DISK_SUPPORT -m32 -ffreestanding -mno-mmx -mno-sse -msoft-float -march=i386 -I. -Iinclude -g -MD -MF.depend.sbrk.o -MTsbrk.o -std=gnu17 -Wno-format-zero-length -Wsystem-headers -Werror -Wno-pointer-sign -Wdate-time -Wno-error=address -Wno-error=array-bounds -Wno-error=attributes -Wno-error=bool-compare -Wno-error=cast-align -Wno-error=clobbered -Wno-error=deprecated-declarations -Wno-error=enum-compare -Wno-error=extra -Wno-error=logical-not-parentheses -Wno-error=strict-aliasing -Wno-error=uninitialized -Wno-error=unused-function -Wno-error=unused-value -Wno-error=empty-body -Wno-error=maybe-uninitialized -Wno-error=nonnull-compare -Wno-error=shift-negative-value -Wno-error=tautological-compare -Wno-error=unused-const-variable -Wno-error=bool-operation -Wno-error=deprecated -Wno-error=expansion-to-defined -Wno-error=format-overflow -Wno-error=format-truncation -Wno-error=implicit-fallthrough -Wno-error=int-in-bool-context -Wno-error=memset-elt-size -Wno-error=noexcept-type -Wno-error=nonnull -Wno-error=pointer-compare -Wno-error=stringop-overflow -Wno-error=aggressive-loop-optimizations -Wno-error=cast-function-type -Wno-error=catch-value -Wno-error=multistatement-macros -Wno-error=restrict -Wno-error=sizeof-pointer-memaccess -Wno-error=stringop-truncation -Wno-return-type -Wno-address-of-packed-member -Os -mpreferred-stack-boundary=2 -c /workspace/src/stand/libsa/sbrk.c -o sbrk.o
--- all_subdir_sbin ---
cc1: all warnings being treated as errors
--- all_subdir_stand ---
--- tslog.o ---
/usr/local/bin/x86_64-unknown-freebsd15.1-gcc14 --sysroot=/tmp/obj/workspace/src/amd64.amd64/tmp -B/usr/local/x86_64-unknown-freebsd15.1/bin/ -O2 -pipe -fno-common -Wformat -fshort-wchar -mno-red-zone -malign-double -nostdinc -I/tmp/obj/workspace/src/amd64.amd64/stand/libsa32 -I/workspace/src/stand/libsa -D_STANDALONE -I/workspace/src/sys -Ddouble=jagged-little-pill -Dfloat=floaty-mcfloatface -ffunction-sections -fdata-sections -DLOADER_GELI_SUPPORT -I/workspace/src/stand/libsa/geli -DLOADER_DISK_SUPPORT -m32 -ffreestanding -mno-mmx -mno-sse -msoft-float -march=i386 -I. -Iinclude -g -MD -MF.depend.tslog.o -MTtslog.o -std=gnu17 -Wno-format-zero-length -Wsystem-headers -Werror -Wno-pointer-sign -Wdate-time -Wno-error=address -Wno-error=array-bounds -Wno-error=attributes -Wno-error=bool-compare -Wno-error=cast-align -Wno-error=clobbered -Wno-error=deprecated-declarations -Wno-error=enum-compare -Wno-error=extra -Wno-error=logical-not-parentheses -Wno-error=strict-aliasing -Wno-error=uninitialized -Wno-error=unused-function -Wno-error=unused-value -Wno-error=empty-body -Wno-error=maybe-uninitialized -Wno-error=nonnull-compare -Wno-error=shift-negative-value -Wno-error=tautological-compare -Wno-error=unused-const-variable -Wno-error=bool-operation -Wno-error=deprecated -Wno-error=expansion-to-defined -Wno-error=format-overflow -Wno-error=format-truncation -Wno-error=implicit-fallthrough -Wno-error=int-in-bool-context -Wno-error=memset-elt-size -Wno-error=noexcept-type -Wno-error=nonnull -Wno-error=pointer-compare -Wno-error=stringop-overflow -Wno-error=aggressive-loop-optimizations -Wno-error=cast-function-type -Wno-error=catch-value -Wno-error=multistatement-macros -Wno-error=restrict -Wno-error=sizeof-pointer-memaccess -Wno-error=stringop-truncation -Wno-return-type -Wno-address-of-packed-member -Os -mpreferred-stack-boundary=2 -c /workspace/src/stand/libsa/tslog.c -o tslog.o
--- all_subdir_sbin ---
*** [format.pieo] Error code 1
make[4]: stopped making "all" in /workspace/src/sbin/nvmecontrol
make[4]: 1 error
make[4]: stopped making "all" in /workspace/src/sbin/nvmecontrol
make[3]: stopped making "all" in /workspace/src/sbin
make[2]: stopped making "all" in /workspace/src
--- all_subdir_stand ---
make[4]: stopped making "all" in /workspace/src/stand/efi
make[3]: stopped making "all" in /workspace/src/stand
--- all_subdir_rescue ---
--- ifconfig_make ---
make[5]: stopped making "objs" in /tmp/obj/workspace/src/amd64.amd64/rescue/rescue
--- all_subdir_stand ---
--- all_subdir_stand/i386 ---
make[4]: stopped making "all" in /workspace/src/stand/i386
make[3]: stopped making "all" in /workspace/src/stand
make[2]: stopped making "all" in /workspace/src
--- all_subdir_rescue ---
--- init_make ---
make[5]: stopped making "objs" in /tmp/obj/workspace/src/amd64.amd64/rescue/rescue
*** [objs] Error code 2
make[4]: stopped making "all" in /workspace/src/rescue/rescue
make[4]: 1 error
make[4]: stopped making "all" in /workspace/src/rescue/rescue
make[3]: stopped making "all" in /workspace/src/rescue
make[2]: stopped making "all" in /workspace/src
--- all_subdir_secure ---
--- all_subdir_secure/usr.bin/ssh ---
make[4]: stopped making "all" in /workspace/src/secure/usr.bin
--- all_subdir_secure/usr.bin/openssl ---
--- s_server.pieo ---
make[4]: stopped making "all" in /workspace/src/secure/usr.bin
make[3]: stopped making "all" in /workspace/src/secure
make[2]: stopped making "all" in /workspace/src
--- all_subdir_share ---
In file included from /tmp/obj/workspace/src/amd64.amd64/tmp/usr/include/c++/v1/__algorithm/inplace_merge.h:27,
from /tmp/obj/workspace/src/amd64.amd64/tmp/usr/include/c++/v1/algorithm:1865,
from /workspace/src/contrib/googletest/googletest/samples/prime_tables.h:37,
from /workspace/src/contrib/googletest/googletest/samples/sample8_unittest.cc:37:
In member function 'std::__1::__add_lvalue_reference_t<_Tp> std::__1::unique_ptr<_Tp [], _Dp>::operator[](std::__1::size_t) const [with _Tp = std::__1::__hash_node_base<std::__1::__hash_node<std::__1::__hash_value_type<std::__1::basic_string<char>, long unsigned int>, void*>*>*; _Dp = std::__1::__bucket_list_deallocator<std::__1::allocator<std::__1::__hash_node_base<std::__1::__hash_node<std::__1::__hash_value_type<std::__1::basic_string<char>, long unsigned int>, void*>*>*> >]',
inlined from 'std::__1::pair<std::__1::__hash_iterator<typename std::__1::__make_hash_node_types<_Tp, typename std::__1::allocator_traits<_Alloc>::void_pointer>::type::__node_pointer>, bool> std::__1::__hash_table<_Tp, _Hash, _Equal, _Alloc>::__emplace_unique_key_args(const _Key&, _Args&& ...) [with _Key = std::__1::basic_string<char>; _Args = {std::__1::basic_string<char, std::__1::char_traits<char>, std::__1::allocator<char> >, long unsigned int}; _Tp = std::__1::__hash_value_type<std::__1::basic_string<char>, long unsigned int>; _Hash = std::__1::__unordered_map_hasher<std::__1::basic_string<char>, std::__1::pair<const std::__1::basic_string<char>, long unsigned int>, std::__1::hash<std::__1::basic_string<char> >, std::__1::equal_to<std::__1::basic_string<char> >, true>; _Equal = std::__1::__unordered_map_equal<std::__1::basic_string<char>, std::__1::pair<const std::__1::basic_string<char>, long unsigned int>, std::__1::equal_to<std::__1::basic_string<char> >, std::__1::hash<std::__1::basic_string<char> >, true>; _Alloc = std::__1::allocator<std::__1::pair<const std::__1::basic_string<char>, long unsigned int> >]' at /tmp/obj/workspace/src/amd64.amd64/tmp/usr/include/c++/v1/__hash_table:1594:41,
inlined from 'std::__1::pair<std::__1::__hash_iterator<typename std::__1::__make_hash_node_types<_Tp, typename std::__1::allocator_traits<_Alloc>::void_pointer>::type::__node_pointer>, bool> std::__1::__hash_table<_Tp, _Hash, _Equal, _Alloc>::__emplace_unique(_First&&, _Second&&) [with _First = std::__1::basic_string<char>; _Second = long unsigned int; typename std::__1::enable_if<std::__1::__can_extract_map_key<_First, typename std::__1::__make_hash_node_types<_Tp, typename std::__1::allocator_traits<_Alloc>::void_pointer>::type::key_type, typename std::__1::__make_hash_node_types<_Tp, typename std::__1::allocator_traits<_Alloc>::void_pointer>::type::__container_value_type>::value, int>::type <anonymous> = 0; _Tp = std::__1::__hash_value_type<std::__1::basic_string<char>, long unsigned int>; _Hash = std::__1::__unordered_map_hasher<std::__1::basic_string<char>, std::__1::pair<const std::__1::basic_string<char>, long unsigned int>, std::__1::hash<std::__1::basic_string<char> >, std::__1::equal_to<std::__1::basic_string<char> >, true>; _Equal = std::__1::__unordered_map_equal<std::__1::basic_string<char>, std::__1::pair<const std::__1::basic_string<char>, long unsigned int>, std::__1::equal_to<std::__1::basic_string<char> >, std::__1::hash<std::__1::basic_string<char> >, true>; _Alloc = std::__1::allocator<std::__1::pair<const std::__1::basic_string<char>, long unsigned int> >]' at /tmp/obj/workspace/src/amd64.amd64/tmp/usr/include/c++/v1/__hash_table:829:96,
inlined from 'std::__1::pair<std::__1::__hash_map_iterator<typename std::__1::__hash_table<std::__1::__hash_value_type<_Key, _Value>, std::__1::__unordered_map_hasher<_Key, std::__1::pair<const _Key, _Tp>, typename std::__1::__type_identity<_Hash>::type, typename std::__1::__type_identity<_Pred>::type>, std::__1::__unordered_map_equal<_Key, std::__1::pair<const _Key, _Tp>, typename std::__1::__type_identity<_Pred>::type, typename std::__1::__type_identity<_Hash>::type>, typename std::__1::__type_identity<_Alloc>::type>::iterator>, bool> std::__1::unordered_map<_Key, _Tp, _Hash, _Pred, _Alloc>::emplace(_Args&& ...) [with _Args = {std::__1::basic_string<char, std::__1::char_traits<char>, std::__1::allocator<char> >, long unsigned int}; _Key = std::__1::basic_string<char>; _Tp = long unsigned int; _Hash = std::__1::hash<std::__1::basic_string<char> >; _Pred = std::__1::equal_to<std::__1::basic_string<char> >; _Alloc = std::__1::allocator<std::__1::pair<const std::__1::basic_string<char>, long unsigned int> >]' at /tmp/obj/workspace/src/amd64.amd64/tmp/usr/include/c++/v1/unordered_map:1177:37,
inlined from 'testing::internal::ParameterizedTestSuiteInfo<TestCase>* testing::internal::ParameterizedTestSuiteRegistry::GetTestSuitePatternHolder(std::__1::string, testing::internal::CodeLocation) [with TestSuite = {anonymous}::PrimeTableTest]' at /tmp/obj/workspace/src/amd64.amd64/tmp/usr/include/private/gtest/internal/gtest-param-util.h:728:40:
/tmp/obj/workspace/src/amd64.amd64/tmp/usr/include/c++/v1/__memory/unique_ptr.h:583:18: warning: '__chash' may be used uninitialized [-Wmaybe-uninitialized]
583 | return __ptr_[__i];
| ~~~~~~^
In file included from /tmp/obj/workspace/src/amd64.amd64/tmp/usr/include/c++/v1/unordered_map:595,
from /tmp/obj/workspace/src/amd64.amd64/tmp/usr/include/c++/v1/__functional/boyer_moore_searcher.h:26,
from /tmp/obj/workspace/src/amd64.amd64/tmp/usr/include/c++/v1/functional:557,
from /tmp/obj/workspace/src/amd64.amd64/tmp/usr/include/c++/v1/deque:2656,
from /tmp/obj/workspace/src/amd64.amd64/tmp/usr/include/c++/v1/queue:276,
from /tmp/obj/workspace/src/amd64.amd64/tmp/usr/include/c++/v1/format:251,
from /tmp/obj/workspace/src/amd64.amd64/tmp/usr/include/c++/v1/ostream:201,
from /tmp/obj/workspace/src/amd64.amd64/tmp/usr/include/private/gtest/gtest.h:56,
from /workspace/src/contrib/googletest/googletest/samples/sample8_unittest.cc:38:
/tmp/obj/workspace/src/amd64.amd64/tmp/usr/include/c++/v1/__hash_table: In member function 'testing::internal::ParameterizedTestSuiteInfo<TestCase>* testing::internal::ParameterizedTestSuiteRegistry::GetTestSuitePatternHolder(std::__1::string, testing::internal::CodeLocation) [with TestSuite = {anonymous}::PrimeTableTest]':
/tmp/obj/workspace/src/amd64.amd64/tmp/usr/include/c++/v1/__hash_table:1572:10: note: '__chash' was declared here
1572 | size_t __chash;
| ^~~~~~~
--- all_subdir_usr.bin ---
make[3]: stopped making "all" in /workspace/src/usr.bin
make[2]: stopped making "all" in /workspace/src
--- all_subdir_cddl ---
--- all_subdir_cddl/usr.sbin/zfsd/tests ---
make[6]: stopped making "all" in /workspace/src/cddl/usr.sbin/zfsd/tests
make[5]: stopped making "all" in /workspace/src/cddl/usr.sbin/zfsd
make[4]: stopped making "all" in /workspace/src/cddl/usr.sbin
make[3]: stopped making "all" in /workspace/src/cddl
make[2]: stopped making "all" in /workspace/src
--- all_subdir_lib ---
--- all_subdir_lib/msun/tests ---
--- invctrig_test ---
make[5]: stopped making "all" in /workspace/src/lib/msun/tests
make[4]: stopped making "all" in /workspace/src/lib/msun
make[3]: stopped making "all" in /workspace/src/lib
make[2]: stopped making "all" in /workspace/src
--- all_subdir_share ---
make[7]: stopped making "all" in /workspace/src/share/examples/tests/tests/googletest
make[6]: stopped making "all" in /workspace/src/share/examples/tests/tests
make[5]: stopped making "all" in /workspace/src/share/examples/tests
make[4]: stopped making "all" in /workspace/src/share/examples
make[3]: stopped making "all" in /workspace/src/share
make[2]: stopped making "all" in /workspace/src
83.70 real 895.85 user 72.39 sys
make[1]: stopped making "buildworld" in /workspace/src
make: stopped making "buildworld" in /workspace/src
Build step 'Execute shell' marked build as failure
[PostBuildScript] - [INFO] Executing post build scripts.
[FreeBSD-main-amd64-gcc14_build] $ /bin/sh -xe /tmp/jenkins16582426537925268862.sh
+ sh freebsd-ci/scripts/jail/clean.sh
clean jail FreeBSD-main-amd64-gcc14_build
Checking for post-build
Performing post-build step
Checking if email needs to be generated
Email was triggered for: Failure - Any
Sending email for trigger: Failure - Any
Sending mail from default account using System Admin e-mail address