FreeBSD-main-amd64-test - Build #29752 - Still Unstable
Date: Tue, 20 Oct 2026 13:06:54 UTC
FreeBSD-main-amd64-test - Build #29752 (49e3c256e4619c56acc09660bc3c49b68ec32c20) - Still Unstable
Build information: https://ci.FreeBSD.org/job/FreeBSD-main-amd64-test/29752/
Full change log: https://ci.FreeBSD.org/job/FreeBSD-main-amd64-test/29752/changes
Full build log: https://ci.FreeBSD.org/job/FreeBSD-main-amd64-test/29752/console
Status explanation:
"Unstable" - some tests are suspected being broken by the following changes
"Still Unstable" - the failing test cases have not been fixed by these
following changes and this is a notification to note that
these changes have not been fully tested by the CI system
Change summaries:
(Those commits are likely but not certainly responsible)
760efcc775c304d175a360dddf499a7b0d5e3935 by ngie:
sbuf(3): increase test coverage
23ab9a9d09f4b46d0b1334742f466526da3662c1 by ngie:
Revert "sbuf(3): increase test coverage"
642b3d965eb6ef3ecf733950e66fad565a27c967 by ngie:
sbuf(3): increase test coverage
3593be37a49e3f5268259bcc2af58cf730b08335 by ngie:
sbuf(3): clean up tests
49e3c256e4619c56acc09660bc3c49b68ec32c20 by dteske:
bsdinstall: use the GPT label for swap in fstab
The failed test cases:
12 tests failed.
FAILED: lib.libc.sys.nanosleep_test.nanosleep_eintr
Error Message:
Test case body timed out
FAILED: sys.netpfil.pf.igmp.py.TestIGMP::test_ip_opts
Error Message:
/usr/local/lib/python3.12/site-packages/scapy/packet.py:1985: AttributeError
FAILED: sys.netpfil.pf.pfsync.bulk
Error Message:
state not found on synced host
FAILED: sys.kern.ssl_sendfile.eagain_vs_eof
Error Message:
/usr/src/tests/sys/kern/ssl_sendfile.c:485: c.sbytes == -1 not met
FAILED: sys.kern.ssl_sendfile.grow
Error Message:
Test case body timed out
FAILED: sys.kern.ssl_sendfile.truncate
Error Message:
Test case body timed out
FAILED: sbin.dhclient.functional.py.__test_cases_list__
Error Message:
Test case list wrote to stderr
FAILED: usr.bin.diff.diff_test.conflicting_format
Error Message:
atf-check failed; see the output of the test for details
FAILED: lib.libexecinfo.sigtramp_test.test_backtrace_sigtramp
Error Message:
/usr/src/lib/libexecinfo/tests/sigtramp_test.c:30: n > 1 not met
FAILED: sys.net.if_lagg_test.witness
Error Message:
Lock-order reversals involving if_lagg.c detected
FAILED: sys.netinet.udp_bindings.connect_bound_socket_from_2address_jail
Error Message:
/usr/src/tests/sys/netinet/udp_bindings.c:244: connect(s, (struct sockaddr *)&sin, sizeof(sin)) == 0 not met
FAILED: sys.netlink.netlink_socket.overflow
Error Message:
/usr/src/tests/sys/netlink/netlink_socket.c:146: send(fd, &hdr, sizeof(hdr), 0) == sizeof(hdr) not met