FreeBSD-main-amd64-test - Build #29744 - Still unstable

From: <jenkins-admin_at_FreeBSD.org>
Date: Mon, 19 Oct 2026 20:08:13 UTC
FreeBSD-main-amd64-test - Build #29744 (461da47e45e7f8ef8754875f4820d3855e7f4097) - Still unstable

Build information: https://ci.FreeBSD.org/job/FreeBSD-main-amd64-test/29744/
Full change log: https://ci.FreeBSD.org/job/FreeBSD-main-amd64-test/29744/changes
Full build log: https://ci.FreeBSD.org/job/FreeBSD-main-amd64-test/29744/console

Status explanation:
"Unstable" - some tests are suspected being broken by the following changes
"Still Unstable" - the failing test cases have not been fixed by these
                   following changes and this is a notification to note that
                   these changes have not been fully tested by the CI system

Change summaries:
(Those commits are likely but not certainly responsible)

37337c4994745b8143f240fd1b9f64c4255b58fc by adrian:
iwm: fix incorrect mutex / crash use during error detach path

176fd23c88e8f7e3736389547c4a2990736911e7 by adrian:
iwm: ensure NIC is alive during txq enable

461da47e45e7f8ef8754875f4820d3855e7f4097 by adrian:
iwm: mask closed_rb_num to the RX ring size



The failed test cases:

10 tests failed.
FAILED:  sys.netpfil.pf.divert-to.in_dn_in_div_in_out_div_out_dn_out

Error Message:
atf-check failed; see the output of the test for details

FAILED:  sys.kern.ssl_sendfile.eagain_vs_eof

Error Message:
/usr/src/tests/sys/kern/ssl_sendfile.c:485: c.sbytes == -1 not met

FAILED:  sys.kern.ssl_sendfile.grow

Error Message:
Test case body timed out

FAILED:  sys.kern.ssl_sendfile.truncate

Error Message:
Test case body timed out

FAILED:  sbin.dhclient.functional.py.__test_cases_list__

Error Message:
Test case list wrote to stderr

FAILED:  usr.bin.diff.diff_test.conflicting_format

Error Message:
atf-check failed; see the output of the test for details

FAILED:  lib.libexecinfo.sigtramp_test.test_backtrace_sigtramp

Error Message:
/usr/src/lib/libexecinfo/tests/sigtramp_test.c:30: n > 1 not met

FAILED:  sys.net.if_lagg_test.witness

Error Message:
Lock-order reversals involving if_lagg.c detected

FAILED:  sys.netinet.udp_bindings.connect_bound_socket_from_2address_jail

Error Message:
/usr/src/tests/sys/netinet/udp_bindings.c:244: connect(s, (struct sockaddr *)&sin, sizeof(sin)) == 0 not met

FAILED:  sys.netlink.netlink_socket.overflow

Error Message:
/usr/src/tests/sys/netlink/netlink_socket.c:146: send(fd, &hdr, sizeof(hdr), 0) == sizeof(hdr) not met