FreeBSD-main-amd64-test - Build #29729 - Still Unstable
Date: Sun, 18 Oct 2026 09:21:47 UTC
FreeBSD-main-amd64-test - Build #29729 (32a981471c0147ea494745477434807cf8b6dadb) - Still Unstable
Build information: https://ci.FreeBSD.org/job/FreeBSD-main-amd64-test/29729/
Full change log: https://ci.FreeBSD.org/job/FreeBSD-main-amd64-test/29729/changes
Full build log: https://ci.FreeBSD.org/job/FreeBSD-main-amd64-test/29729/console
Status explanation:
"Unstable" - some tests are suspected being broken by the following changes
"Still Unstable" - the failing test cases have not been fixed by these
following changes and this is a notification to note that
these changes have not been fully tested by the CI system
Change summaries:
(Those commits are likely but not certainly responsible)
a7195567fdadb929cfddd190a9666a75ed7652d4 by adrian:
iwm: rename iwm_stop_session_protection() -> iwm_unprotect_session()
c9599b80015a50e66c907dc667334a53bc234dab by olivier:
ktls: Take the receiving interface of each packet in sbappend_ktls_rx()
32a981471c0147ea494745477434807cf8b6dadb by olivier:
ktls: Fix capability checks in ktls_reset_receive_tag()
The failed test cases:
9 tests failed.
FAILED: sbin.dhclient.functional.py.__test_cases_list__
Error Message:
Test case list wrote to stderr
FAILED: usr.bin.diff.diff_test.conflicting_format
Error Message:
atf-check failed; see the output of the test for details
FAILED: sys.kern.ssl_sendfile.truncate
Error Message:
Test case body timed out
FAILED: sys.kern.ssl_sendfile.eagain_vs_eof
Error Message:
/usr/src/tests/sys/kern/ssl_sendfile.c:485: c.sbytes == -1 not met
FAILED: sys.kern.ssl_sendfile.grow
Error Message:
Test case body timed out
FAILED: lib.libexecinfo.sigtramp_test.test_backtrace_sigtramp
Error Message:
/usr/src/lib/libexecinfo/tests/sigtramp_test.c:30: n > 1 not met
FAILED: sys.net.if_lagg_test.witness
Error Message:
Lock-order reversals involving if_lagg.c detected
FAILED: sys.netinet.udp_bindings.connect_bound_socket_from_2address_jail
Error Message:
/usr/src/tests/sys/netinet/udp_bindings.c:244: connect(s, (struct sockaddr *)&sin, sizeof(sin)) == 0 not met
FAILED: sys.netlink.netlink_socket.overflow
Error Message:
/usr/src/tests/sys/netlink/netlink_socket.c:146: send(fd, &hdr, sizeof(hdr), 0) == sizeof(hdr) not met