FreeBSD-main-amd64-test - Build #29726 - Still Unstable

From: <jenkins-admin_at_FreeBSD.org>
Date: Sun, 18 Oct 2026 01:44:03 UTC
FreeBSD-main-amd64-test - Build #29726 (617c700abae7aba74777fca137458395936f5053) - Still Unstable

Build information: https://ci.FreeBSD.org/job/FreeBSD-main-amd64-test/29726/
Full change log: https://ci.FreeBSD.org/job/FreeBSD-main-amd64-test/29726/changes
Full build log: https://ci.FreeBSD.org/job/FreeBSD-main-amd64-test/29726/console

Status explanation:
"Unstable" - some tests are suspected being broken by the following changes
"Still Unstable" - the failing test cases have not been fixed by these
                   following changes and this is a notification to note that
                   these changes have not been fully tested by the CI system

Change summaries:
(Those commits are likely but not certainly responsible)

79d491be21209536d7c410cb1ce892379135f3ce by emaste:
Remove "All Rights Reserved" from FreeBSD Foundation copyrights

617c700abae7aba74777fca137458395936f5053 by emaste:
newvers.sh: Report -dirty also with staged changes



The failed test cases:

10 tests failed.
FAILED:  sbin.dhclient.functional.py.__test_cases_list__

Error Message:
Test case list wrote to stderr

FAILED:  usr.bin.diff.diff_test.conflicting_format

Error Message:
atf-check failed; see the output of the test for details

FAILED:  sys.netpfil.pf.pfsync.bulk

Error Message:
state not found on synced host

FAILED:  sys.kern.ssl_sendfile.truncate

Error Message:
Test case body timed out

FAILED:  sys.kern.ssl_sendfile.eagain_vs_eof

Error Message:
/usr/src/tests/sys/kern/ssl_sendfile.c:485: c.sbytes == -1 not met

FAILED:  sys.kern.ssl_sendfile.grow

Error Message:
Test case body timed out

FAILED:  lib.libexecinfo.sigtramp_test.test_backtrace_sigtramp

Error Message:
/usr/src/lib/libexecinfo/tests/sigtramp_test.c:30: n > 1 not met

FAILED:  sys.net.if_lagg_test.witness

Error Message:
Lock-order reversals involving if_lagg.c detected

FAILED:  sys.netinet.udp_bindings.connect_bound_socket_from_2address_jail

Error Message:
/usr/src/tests/sys/netinet/udp_bindings.c:244: connect(s, (struct sockaddr *)&sin, sizeof(sin)) == 0 not met

FAILED:  sys.netlink.netlink_socket.overflow

Error Message:
/usr/src/tests/sys/netlink/netlink_socket.c:146: send(fd, &hdr, sizeof(hdr), 0) == sizeof(hdr) not met