FreeBSD-stable-15-amd64-test - Build #1189 - Still Unstable
Date: Sat, 17 Oct 2026 18:57:11 UTC
FreeBSD-stable-15-amd64-test - Build #1189 (c54ffb070c1aa072e4eed86548aef76887ef888d) - Still Unstable
Build information: https://ci.FreeBSD.org/job/FreeBSD-stable-15-amd64-test/1189/
Full change log: https://ci.FreeBSD.org/job/FreeBSD-stable-15-amd64-test/1189/changes
Full build log: https://ci.FreeBSD.org/job/FreeBSD-stable-15-amd64-test/1189/console
Status explanation:
"Unstable" - some tests are suspected being broken by the following changes
"Still Unstable" - the failing test cases have not been fixed by these
following changes and this is a notification to note that
these changes have not been fully tested by the CI system
Change summaries:
(Those commits are likely but not certainly responsible)
c54ffb070c1aa072e4eed86548aef76887ef888d by jhb:
.github: Update to use llvm 15
The failed test cases:
5 tests failed.
FAILED: sys.fs.fusefs.ext2-misc.execute
Error Message:
atf-check failed; see the output of the test for details
FAILED: sys.netpfil.pf.pflog.rdr_action
Error Message:
atf-check failed; see the output of the test for details
FAILED: sys.netpfil.pf.pfsync.bulk
Error Message:
state not found on synced host
FAILED: sys.pmc.pmc_api_test.attach_to_sugid_target
Error Message:
1 checks failed; see output for more details
FAILED: lib.libexecinfo.sigtramp_test.test_backtrace_sigtramp
Error Message:
/usr/src/lib/libexecinfo/tests/sigtramp_test.c:30: n > 1 not met