FreeBSD-stable-15-amd64-test - Build #1187 - Still Unstable

From: <jenkins-admin_at_FreeBSD.org>
Date: Sat, 17 Oct 2026 03:47:56 UTC
FreeBSD-stable-15-amd64-test - Build #1187 (afea1a2429bf15ced38993c00cdd5da344ac46e4) - Still Unstable

Build information: https://ci.FreeBSD.org/job/FreeBSD-stable-15-amd64-test/1187/
Full change log: https://ci.FreeBSD.org/job/FreeBSD-stable-15-amd64-test/1187/changes
Full build log: https://ci.FreeBSD.org/job/FreeBSD-stable-15-amd64-test/1187/console

Status explanation:
"Unstable" - some tests are suspected being broken by the following changes
"Still Unstable" - the failing test cases have not been fixed by these
                   following changes and this is a notification to note that
                   these changes have not been fully tested by the CI system

Change summaries:
(Those commits are likely but not certainly responsible)

afea1a2429bf15ced38993c00cdd5da344ac46e4 by kib:
rtld: release rtld_bind_lock around calls to .preinit_array initializers



The failed test cases:

3 tests failed.
FAILED:  sys.netpfil.pf.igmp.py.TestIGMP::test_ip_opts

Error Message:
/usr/local/lib/python3.12/site-packages/scapy/packet.py:1985: AttributeError

FAILED:  sys.netpfil.pf.pfsync.bulk

Error Message:
state not found on synced host

FAILED:  lib.libexecinfo.sigtramp_test.test_backtrace_sigtramp

Error Message:
/usr/src/lib/libexecinfo/tests/sigtramp_test.c:30: n > 1 not met