FreeBSD-main-amd64-test - Build #29717 - Still Unstable

From: <jenkins-admin_at_FreeBSD.org>
Date: Sat, 17 Oct 2026 02:16:31 UTC
FreeBSD-main-amd64-test - Build #29717 (9d50245a0f1333e10cc1c4dda16878cd79a7c42b) - Still Unstable

Build information: https://ci.FreeBSD.org/job/FreeBSD-main-amd64-test/29717/
Full change log: https://ci.FreeBSD.org/job/FreeBSD-main-amd64-test/29717/changes
Full build log: https://ci.FreeBSD.org/job/FreeBSD-main-amd64-test/29717/console

Status explanation:
"Unstable" - some tests are suspected being broken by the following changes
"Still Unstable" - the failing test cases have not been fixed by these
                   following changes and this is a notification to note that
                   these changes have not been fully tested by the CI system

Change summaries:
(Those commits are likely but not certainly responsible)

c83e075d72f62c91cb27dd644a62d6a6f5bd56ba by markj:
amd64/vmm: Don't advertise support for performance counters

9a406a9ec399cced14ce5d204ba3fd383544b47f by markj:
tcp/rack: Fix a potential overflow in rack_update_pcm_ack()

3545fc68f416ee6d3379e0a44ed9eb22fefee2ef by markj:
sound: Check for errors from sndbuf_resize()

47d2d509c6b32b3c2245748f755fbf2344351d94 by markj:
sound: Revalidate after reacquiring locks when resizing buffers

1d14ab14dd72f5141eddce84df8ec5b74dbb8cd7 by markj:
bhyve: Fix handling of the xhci event ring

81b9fcfa0bbca2f9931a9b9a5e6fde0972f08cfa by markj:
bhyve: Improve HDA stream descriptor validation

ac6f9513b210097410dcd6f44e9523f990ba7b92 by markj:
bhyve: Fix handling of framebuffer resizing

9d50245a0f1333e10cc1c4dda16878cd79a7c42b by pkubaj:
machine/ieeefp.h: include <sys/cdefs.h>



The failed test cases:

8 tests failed.
FAILED:  sys.netpfil.pf.pfsync.bulk

Error Message:
state not found on synced host

FAILED:  sys.kern.ssl_sendfile.truncate

Error Message:
Test case body timed out

FAILED:  sys.kern.ssl_sendfile.eagain_vs_eof

Error Message:
/usr/src/tests/sys/kern/ssl_sendfile.c:485: c.sbytes == -1 not met

FAILED:  sys.kern.ssl_sendfile.grow

Error Message:
Test case body timed out

FAILED:  lib.libexecinfo.sigtramp_test.test_backtrace_sigtramp

Error Message:
/usr/src/lib/libexecinfo/tests/sigtramp_test.c:30: n > 1 not met

FAILED:  sys.net.if_lagg_test.witness

Error Message:
Lock-order reversals involving if_lagg.c detected

FAILED:  sys.netinet.udp_bindings.connect_bound_socket_from_2address_jail

Error Message:
/usr/src/tests/sys/netinet/udp_bindings.c:244: connect(s, (struct sockaddr *)&sin, sizeof(sin)) == 0 not met

FAILED:  sys.netlink.netlink_socket.overflow

Error Message:
/usr/src/tests/sys/netlink/netlink_socket.c:146: send(fd, &hdr, sizeof(hdr), 0) == sizeof(hdr) not met