FreeBSD-main-amd64-test - Build #29712 - Still Unstable
Date: Fri, 16 Oct 2026 15:04:26 UTC
FreeBSD-main-amd64-test - Build #29712 (90c8c8e451058289660e798b242ff5d27f9e7d1e) - Still Unstable
Build information: https://ci.FreeBSD.org/job/FreeBSD-main-amd64-test/29712/
Full change log: https://ci.FreeBSD.org/job/FreeBSD-main-amd64-test/29712/changes
Full build log: https://ci.FreeBSD.org/job/FreeBSD-main-amd64-test/29712/console
Status explanation:
"Unstable" - some tests are suspected being broken by the following changes
"Still Unstable" - the failing test cases have not been fixed by these
following changes and this is a notification to note that
these changes have not been fully tested by the CI system
Change summaries:
(Those commits are likely but not certainly responsible)
3943973aaeba035bf36b34dfb9354d8d1c4684b9 by br:
mgb: increase timeout
030e556ff8a9dfa6fd7b5328e410eb806f4d07ed by seuros:
acpi_lid: add an in-kernel lid state eventhandler
e6dc001d7a387100125718322fa741444a9025fc by rcm:
pf: Do not hash pool address pointers into rule hashes
68831d2a2cbb34e8daf24db7e4e15b8c09451f85 by rcm:
pf: Register the netlink family only while the vnets are set up
5fb07bbcd5d5d9a865d9e7765fb93e9ba5edef1c by aokblast:
libthr: Fix LIBPTHREAD_QUEUE_FIFO range
23626eb9e3d61928358c9c813aa5a17e797ba404 by aokblast:
linux: cap mount id to INT_MAX
b6a34e83651ce2bf4d1eea8d6f7f0f5bf4d9469c by ahze:
committers-ports.dot: Restore ahze from alumni
0571d8a0cc606be9a216439b3cfea685b709d6ea by mchoo:
powerpc: Avoid deadlock when CPUs exchange threads
a20bbabe343148c1a6d4b234c05fbcc9916c840d by glebius:
ipfw: re-arrange declarations so that they match comments
90c8c8e451058289660e798b242ff5d27f9e7d1e by glebius:
netinet: garbage collect __IPPROTO_DIVERT
The failed test cases:
9 tests failed.
FAILED: sys.netpfil.pf.igmp.py.TestIGMP::test_ip_opts
Error Message:
/usr/local/lib/python3.12/site-packages/scapy/packet.py:1985: AttributeError
FAILED: sys.netpfil.pf.pfsync.bulk
Error Message:
state not found on synced host
FAILED: sys.kern.ssl_sendfile.truncate
Error Message:
Test case body timed out
FAILED: sys.kern.ssl_sendfile.eagain_vs_eof
Error Message:
/usr/src/tests/sys/kern/ssl_sendfile.c:485: c.sbytes == -1 not met
FAILED: sys.kern.ssl_sendfile.grow
Error Message:
Test case body timed out
FAILED: lib.libexecinfo.sigtramp_test.test_backtrace_sigtramp
Error Message:
/usr/src/lib/libexecinfo/tests/sigtramp_test.c:30: n > 1 not met
FAILED: sys.net.if_lagg_test.witness
Error Message:
Lock-order reversals involving if_lagg.c detected
FAILED: sys.netinet.udp_bindings.connect_bound_socket_from_2address_jail
Error Message:
/usr/src/tests/sys/netinet/udp_bindings.c:244: connect(s, (struct sockaddr *)&sin, sizeof(sin)) == 0 not met
FAILED: sys.netlink.netlink_socket.overflow
Error Message:
/usr/src/tests/sys/netlink/netlink_socket.c:146: send(fd, &hdr, sizeof(hdr), 0) == sizeof(hdr) not met