FreeBSD-stable-15-amd64-test - Build #1181 - Still Unstable
Date: Thu, 15 Oct 2026 04:45:03 UTC
FreeBSD-stable-15-amd64-test - Build #1181 (e4a203a17fde3ccafd99316932d29224fc5cd3c4) - Still Unstable
Build information: https://ci.FreeBSD.org/job/FreeBSD-stable-15-amd64-test/1181/
Full change log: https://ci.FreeBSD.org/job/FreeBSD-stable-15-amd64-test/1181/changes
Full build log: https://ci.FreeBSD.org/job/FreeBSD-stable-15-amd64-test/1181/console
Status explanation:
"Unstable" - some tests are suspected being broken by the following changes
"Still Unstable" - the failing test cases have not been fixed by these
following changes and this is a notification to note that
these changes have not been fully tested by the CI system
Change summaries:
(Those commits are likely but not certainly responsible)
e4a203a17fde3ccafd99316932d29224fc5cd3c4 by rmacklem:
nfs_nfsdsocket.c: Fix "nfsstats -d" for ERELOOKUP
The failed test cases:
3 tests failed.
FAILED: sys.netpfil.pf.igmp.py.TestIGMP::test_ip_opts
Error Message:
/usr/local/lib/python3.12/site-packages/scapy/packet.py:1985: AttributeError
FAILED: sys.netpfil.pf.pfsync.bulk
Error Message:
state not found on synced host
FAILED: lib.libexecinfo.sigtramp_test.test_backtrace_sigtramp
Error Message:
/usr/src/lib/libexecinfo/tests/sigtramp_test.c:30: n > 1 not met