FreeBSD-main-amd64-test - Build #29696 - Still Unstable

From: <jenkins-admin_at_FreeBSD.org>
Date: Wed, 14 Oct 2026 20:08:08 UTC
FreeBSD-main-amd64-test - Build #29696 (8f93ad70078a88710d34b371a4076191cfebc4f6) - Still Unstable

Build information: https://ci.FreeBSD.org/job/FreeBSD-main-amd64-test/29696/
Full change log: https://ci.FreeBSD.org/job/FreeBSD-main-amd64-test/29696/changes
Full build log: https://ci.FreeBSD.org/job/FreeBSD-main-amd64-test/29696/console

Status explanation:
"Unstable" - some tests are suspected being broken by the following changes
"Still Unstable" - the failing test cases have not been fixed by these
                   following changes and this is a notification to note that
                   these changes have not been fully tested by the CI system

Change summaries:
(Those commits are likely but not certainly responsible)

b3ef4013a4fa75063930d0221a0bc50f95af0527 by adrian:
iwm: add lock assertion checks

1f07bcd91de1d02d1adb8a1215945cd02f469489 by adrian:
iwm: placeholders for HT rates, update some FW flags to openbsd

b00a90df99f72c30bdeec17bb0fb0cd28342415d by adrian:
iwm: bring over placeholder calibration information

65373e8d02391054eb867edaeb92348c6f2d4ff4 by adrian:
iwm: bring in the command table version code from openbsd

b15ec53784f3be913d6b4711f8eb166584a7d791 by adrian:
iwm: Intel 9000 series bits from OpenBSD

e6ca3d05b93b5f36dde2873076d7bc29dbcd46d1 by adrian:
iwm: add thermal cutoff to firmware command support

7ce67909fa683b22546b2ec8d635db1582b56bca by adrian:
iwm: clear persistence bit on 9000 series NICs

8f93ad70078a88710d34b371a4076191cfebc4f6 by adrian:
iwm: add MSI-X support



The failed test cases:

8 tests failed.
FAILED:  sys.netpfil.pf.syncookie.basic_v6

Error Message:
Failed to connect to syncookie protected echo daemon

FAILED:  sys.netpfil.pf.pfsync.bulk

Error Message:
state not found on synced host

FAILED:  sys.kern.ssl_sendfile.eagain_vs_eof

Error Message:
/usr/src/tests/sys/kern/ssl_sendfile.c:485: c.sbytes == -1 not met

FAILED:  sys.kern.ssl_sendfile.grow

Error Message:
Test case body timed out

FAILED:  lib.libexecinfo.sigtramp_test.test_backtrace_sigtramp

Error Message:
/usr/src/lib/libexecinfo/tests/sigtramp_test.c:30: n > 1 not met

FAILED:  sys.net.if_lagg_test.witness

Error Message:
Lock-order reversals involving if_lagg.c detected

FAILED:  sys.netinet.udp_bindings.connect_bound_socket_from_2address_jail

Error Message:
/usr/src/tests/sys/netinet/udp_bindings.c:244: connect(s, (struct sockaddr *)&sin, sizeof(sin)) == 0 not met

FAILED:  sys.netlink.netlink_socket.overflow

Error Message:
/usr/src/tests/sys/netlink/netlink_socket.c:146: send(fd, &hdr, sizeof(hdr), 0) == sizeof(hdr) not met