FreeBSD-main-amd64-build - Build #37106 - Failure
Date: Wed, 14 Oct 2026 02:04:29 UTC
FreeBSD-main-amd64-build - Build #37106 (fe90f180047bc2cb4d15d4a31033741add5f5d10) - Failure
Build information: https://ci.FreeBSD.org/job/FreeBSD-main-amd64-build/37106/
Full change log: https://ci.FreeBSD.org/job/FreeBSD-main-amd64-build/37106/changes
Full build log: https://ci.FreeBSD.org/job/FreeBSD-main-amd64-build/37106/console
Status explanation:
"Failure" - the build is suspected being broken by the following changes
"Still Failing" - the build has not been fixed by the following changes and
this is a notification to note that these changes have
not been fully tested by the CI system
Change summaries:
(Those commits are likely but not certainly responsible)
fe90f180047bc2cb4d15d4a31033741add5f5d10 by rcm:
epoch: Queue drain callbacks from each CPU's callback task
The end of the build log:
[...truncated 105.84 MiB...]
a ./usr/lib/debug/boot/kernel/snd_vibes.ko.debug
a ./usr/lib/debug/boot/kernel/snp.ko.debug
a ./usr/lib/debug/boot/kernel/sound.ko.debug
a ./usr/lib/debug/boot/kernel/speaker.ko.debug
a ./usr/lib/debug/boot/kernel/spibus.ko.debug
a ./usr/lib/debug/boot/kernel/spigen.ko.debug
a ./usr/lib/debug/boot/kernel/splash_bmp.ko.debug
a ./usr/lib/debug/boot/kernel/splash_pcx.ko.debug
a ./usr/lib/debug/boot/kernel/splash_txt.ko.debug
a ./usr/lib/debug/boot/kernel/star_saver.ko.debug
a ./usr/lib/debug/boot/kernel/superio.ko.debug
a ./usr/lib/debug/boot/kernel/sym.ko.debug
a ./usr/lib/debug/boot/kernel/systrace.ko.debug
a ./usr/lib/debug/boot/kernel/systrace_freebsd32.ko.debug
a ./usr/lib/debug/boot/kernel/systrace_linux.ko.debug
a ./usr/lib/debug/boot/kernel/systrace_linux32.ko.debug
a ./usr/lib/debug/boot/kernel/sysvmsg.ko.debug
a ./usr/lib/debug/boot/kernel/sysvsem.ko.debug
a ./usr/lib/debug/boot/kernel/sysvshm.ko.debug
a ./usr/lib/debug/boot/kernel/t4_tom.ko.debug
a ./usr/lib/debug/boot/kernel/t4fw_cfg.ko.debug
a ./usr/lib/debug/boot/kernel/t5fw_cfg.ko.debug
a ./usr/lib/debug/boot/kernel/t6fw_cfg.ko.debug
a ./usr/lib/debug/boot/kernel/t7fw_cfg.ko.debug
a ./usr/lib/debug/boot/kernel/tarfs.ko.debug
a ./usr/lib/debug/boot/kernel/tb.ko.debug
a ./usr/lib/debug/boot/kernel/tcp_bbr.ko.debug
a ./usr/lib/debug/boot/kernel/tcp_rack.ko.debug
a ./usr/lib/debug/boot/kernel/tcphpts.ko.debug
a ./usr/lib/debug/boot/kernel/tcpmd5.ko.debug
a ./usr/lib/debug/boot/kernel/tglhgpio.ko.debug
a ./usr/lib/debug/boot/kernel/tmpfs.ko.debug
a ./usr/lib/debug/boot/kernel/toecore.ko.debug
a ./usr/lib/debug/boot/kernel/tpm.ko.debug
a ./usr/lib/debug/boot/kernel/tws.ko.debug
a ./usr/lib/debug/boot/kernel/u2f.ko.debug
a ./usr/lib/debug/boot/kernel/u3g.ko.debug
a ./usr/lib/debug/boot/kernel/uacpi.ko.debug
a ./usr/lib/debug/boot/kernel/uark.ko.debug
a ./usr/lib/debug/boot/kernel/uart.ko.debug
a ./usr/lib/debug/boot/kernel/ubsa.ko.debug
a ./usr/lib/debug/boot/kernel/ubser.ko.debug
a ./usr/lib/debug/boot/kernel/ubtbcmfw.ko.debug
a ./usr/lib/debug/boot/kernel/uchcom.ko.debug
a ./usr/lib/debug/boot/kernel/ucom.ko.debug
a ./usr/lib/debug/boot/kernel/ucycom.ko.debug
a ./usr/lib/debug/boot/kernel/udbc.ko.debug
a ./usr/lib/debug/boot/kernel/udbp.ko.debug
a ./usr/lib/debug/boot/kernel/udf.ko.debug
a ./usr/lib/debug/boot/kernel/udf_iconv.ko.debug
a ./usr/lib/debug/boot/kernel/udl.ko.debug
a ./usr/lib/debug/boot/kernel/uep.ko.debug
a ./usr/lib/debug/boot/kernel/uether.ko.debug
a ./usr/lib/debug/boot/kernel/ufoma.ko.debug
a ./usr/lib/debug/boot/kernel/ufs.ko.debug
a ./usr/lib/debug/boot/kernel/ufshci.ko.debug
a ./usr/lib/debug/boot/kernel/uftdi.ko.debug
a ./usr/lib/debug/boot/kernel/ugensa.ko.debug
a ./usr/lib/debug/boot/kernel/ugold.ko.debug
a ./usr/lib/debug/boot/kernel/uhci.ko.debug
a ./usr/lib/debug/boot/kernel/uhid.ko.debug
a ./usr/lib/debug/boot/kernel/uhid_snes.ko.debug
a ./usr/lib/debug/boot/kernel/uhso.ko.debug
a ./usr/lib/debug/boot/kernel/uinput.ko.debug
a ./usr/lib/debug/boot/kernel/uipaq.ko.debug
a ./usr/lib/debug/boot/kernel/ukbd.ko.debug
a ./usr/lib/debug/boot/kernel/uled.ko.debug
a ./usr/lib/debug/boot/kernel/ulpt.ko.debug
a ./usr/lib/debug/boot/kernel/umass.ko.debug
a ./usr/lib/debug/boot/kernel/umb.ko.debug
a ./usr/lib/debug/boot/kernel/umcs.ko.debug
a ./usr/lib/debug/boot/kernel/umct.ko.debug
a ./usr/lib/debug/boot/kernel/umodem.ko.debug
a ./usr/lib/debug/boot/kernel/umoscom.ko.debug
a ./usr/lib/debug/boot/kernel/ums.ko.debug
a ./usr/lib/debug/boot/kernel/unionfs.ko.debug
a ./usr/lib/debug/boot/kernel/uplcom.ko.debug
a ./usr/lib/debug/boot/kernel/urio.ko.debug
a ./usr/lib/debug/boot/kernel/usb.ko.debug
a ./usr/lib/debug/boot/kernel/usb_quirk.ko.debug
a ./usr/lib/debug/boot/kernel/usb_template.ko.debug
a ./usr/lib/debug/boot/kernel/usbhid.ko.debug
a ./usr/lib/debug/boot/kernel/usfs.ko.debug
a ./usr/lib/debug/boot/kernel/usie.ko.debug
a ./usr/lib/debug/boot/kernel/uslcom.ko.debug
a ./usr/lib/debug/boot/kernel/uvideo.ko.debug
a ./usr/lib/debug/boot/kernel/uvisor.ko.debug
a ./usr/lib/debug/boot/kernel/uvscom.ko.debug
a ./usr/lib/debug/boot/kernel/vesa.ko.debug
a ./usr/lib/debug/boot/kernel/viapm.ko.debug
a ./usr/lib/debug/boot/kernel/viawd.ko.debug
a ./usr/lib/debug/boot/kernel/video.ko.debug
a ./usr/lib/debug/boot/kernel/videomode.ko.debug
a ./usr/lib/debug/boot/kernel/virtio.ko.debug
a ./usr/lib/debug/boot/kernel/virtio_balloon.ko.debug
a ./usr/lib/debug/boot/kernel/virtio_blk.ko.debug
a ./usr/lib/debug/boot/kernel/virtio_console.ko.debug
a ./usr/lib/debug/boot/kernel/virtio_p9fs.ko.debug
a ./usr/lib/debug/boot/kernel/virtio_pci.ko.debug
a ./usr/lib/debug/boot/kernel/virtio_random.ko.debug
a ./usr/lib/debug/boot/kernel/virtio_scsi.ko.debug
a ./usr/lib/debug/boot/kernel/vkbd.ko.debug
a ./usr/lib/debug/boot/kernel/vmci.ko.debug
a ./usr/lib/debug/boot/kernel/vmd.ko.debug
a ./usr/lib/debug/boot/kernel/vmm.ko.debug
a ./usr/lib/debug/boot/kernel/vpd.ko.debug
a ./usr/lib/debug/boot/kernel/warp_saver.ko.debug
a ./usr/lib/debug/boot/kernel/wbwd.ko.debug
a ./usr/lib/debug/boot/kernel/wdatwd.ko.debug
a ./usr/lib/debug/boot/kernel/wlan.ko.debug
a ./usr/lib/debug/boot/kernel/wlan_acl.ko.debug
a ./usr/lib/debug/boot/kernel/wlan_amrr.ko.debug
a ./usr/lib/debug/boot/kernel/wlan_ccmp.ko.debug
a ./usr/lib/debug/boot/kernel/wlan_gcmp.ko.debug
a ./usr/lib/debug/boot/kernel/wlan_rssadapt.ko.debug
a ./usr/lib/debug/boot/kernel/wlan_tkip.ko.debug
a ./usr/lib/debug/boot/kernel/wlan_wep.ko.debug
a ./usr/lib/debug/boot/kernel/wlan_xauth.ko.debug
a ./usr/lib/debug/boot/kernel/wmt.ko.debug
a ./usr/lib/debug/boot/kernel/wpifw.ko.debug
a ./usr/lib/debug/boot/kernel/wsp.ko.debug
a ./usr/lib/debug/boot/kernel/wtap.ko.debug
a ./usr/lib/debug/boot/kernel/x86bios.ko.debug
a ./usr/lib/debug/boot/kernel/xb360gp.ko.debug
a ./usr/lib/debug/boot/kernel/xdr.ko.debug
a ./usr/lib/debug/boot/kernel/xhci.ko.debug
a ./usr/lib/debug/boot/kernel/xz.ko.debug
a ./usr/lib/debug/boot/kernel/zfs.ko.debug
a ./usr/lib/debug/boot/kernel/zlib.ko.debug
mv dist/kernel*.txz .
sh /usr/src/release/scripts/make-manifest.sh $(ls *.txz | grep -v container) > MANIFEST
FATAL: command execution failed
java.nio.channels.ClosedChannelException
at org.jenkinsci.remoting.protocol.impl.ChannelApplicationLayer.onReadClosed(ChannelApplicationLayer.java:241)
at org.jenkinsci.remoting.protocol.ApplicationLayer.onRecvClosed(ApplicationLayer.java:221)
at org.jenkinsci.remoting.protocol.ProtocolStack$Ptr.onRecvClosed(ProtocolStack.java:826)
at org.jenkinsci.remoting.protocol.FilterLayer.onRecvClosed(FilterLayer.java:289)
at org.jenkinsci.remoting.protocol.impl.SSLEngineFilterLayer.onRecvClosed(SSLEngineFilterLayer.java:176)
at org.jenkinsci.remoting.protocol.impl.SSLEngineFilterLayer.switchToNoSecure(SSLEngineFilterLayer.java:278)
at org.jenkinsci.remoting.protocol.impl.SSLEngineFilterLayer.processWrite(SSLEngineFilterLayer.java:502)
at org.jenkinsci.remoting.protocol.impl.SSLEngineFilterLayer.processQueuedWrites(SSLEngineFilterLayer.java:243)
at org.jenkinsci.remoting.protocol.impl.SSLEngineFilterLayer.doSend(SSLEngineFilterLayer.java:195)
at org.jenkinsci.remoting.protocol.impl.SSLEngineFilterLayer.doCloseSend(SSLEngineFilterLayer.java:208)
at org.jenkinsci.remoting.protocol.ProtocolStack$Ptr.doCloseSend(ProtocolStack.java:794)
at org.jenkinsci.remoting.protocol.ApplicationLayer.doCloseWrite(ApplicationLayer.java:172)
at org.jenkinsci.remoting.protocol.impl.ChannelApplicationLayer$ByteBufferCommandTransport.closeWrite(ChannelApplicationLayer.java:348)
at hudson.remoting.Channel.close(Channel.java:1619)
at hudson.remoting.Channel.close(Channel.java:1567)
at hudson.slaves.SlaveComputer.closeChannel(SlaveComputer.java:954)
at hudson.slaves.SlaveComputer.lambda$disconnect$1(SlaveComputer.java:825)
at jenkins.util.ContextResettingExecutorService.lambda$wrap$0(ContextResettingExecutorService.java:26)
at jenkins.security.ImpersonatingExecutorService.lambda$wrap$0(ImpersonatingExecutorService.java:66)
at jenkins.util.ErrorLoggingExecutorService.lambda$wrap$0(ErrorLoggingExecutorService.java:51)
at java.base/java.util.concurrent.Executors$RunnableAdapter.call(Executors.java:545)
at java.base/java.util.concurrent.FutureTask.run(FutureTask.java:328)
at java.base/java.util.concurrent.ThreadPoolExecutor.runWorker(ThreadPoolExecutor.java:1090)
at java.base/java.util.concurrent.ThreadPoolExecutor$Worker.run(ThreadPoolExecutor.java:614)
at java.base/java.lang.Thread.run(Thread.java:1474)
Caused: hudson.remoting.ChannelClosedException: Channel "hudson.remoting.Channel@17fa87f1:JNLP4-connect connection from lackey2.chi.freebsd.org/[2610:1c0:1040:607c:0:0:16:20]:24340": Remote call on JNLP4-connect connection from lackey2.chi.freebsd.org/[2610:1c0:1040:607c:0:0:16:20]:24340 failed. The channel is closing down or has closed down
at hudson.remoting.Channel.call(Channel.java:1101)
at hudson.remoting.RemoteInvocationHandler.invoke(RemoteInvocationHandler.java:306)
at jdk.proxy2/jdk.proxy2.$Proxy236.isAlive(Unknown Source)
at hudson.Launcher$RemoteLauncher$ProcImpl.isAlive(Launcher.java:1227)
at hudson.Launcher$RemoteLauncher$ProcImpl.join(Launcher.java:1219)
at hudson.tasks.CommandInterpreter.join(CommandInterpreter.java:195)
at hudson.tasks.CommandInterpreter.perform(CommandInterpreter.java:145)
at hudson.tasks.CommandInterpreter.perform(CommandInterpreter.java:92)
at hudson.tasks.BuildStepMonitor$1.perform(BuildStepMonitor.java:20)
at hudson.model.AbstractBuild$AbstractBuildExecution.perform(AbstractBuild.java:817)
at hudson.model.Build$BuildExecution.build(Build.java:199)
at hudson.model.Build$BuildExecution.doRun(Build.java:164)
at hudson.model.AbstractBuild$AbstractBuildExecution.run(AbstractBuild.java:526)
at hudson.model.Run.execute(Run.java:1849)
at hudson.model.FreeStyleBuild.run(FreeStyleBuild.java:44)
at hudson.model.ResourceController.execute(ResourceController.java:97)
at hudson.model.Executor.run(Executor.java:456)
FATAL: Unable to delete script file /tmp/jenkins14158651011464598616.sh
java.nio.channels.ClosedChannelException
at org.jenkinsci.remoting.protocol.impl.ChannelApplicationLayer.onReadClosed(ChannelApplicationLayer.java:241)
at org.jenkinsci.remoting.protocol.ApplicationLayer.onRecvClosed(ApplicationLayer.java:221)
at org.jenkinsci.remoting.protocol.ProtocolStack$Ptr.onRecvClosed(ProtocolStack.java:826)
at org.jenkinsci.remoting.protocol.FilterLayer.onRecvClosed(FilterLayer.java:289)
at org.jenkinsci.remoting.protocol.impl.SSLEngineFilterLayer.onRecvClosed(SSLEngineFilterLayer.java:176)
at org.jenkinsci.remoting.protocol.impl.SSLEngineFilterLayer.switchToNoSecure(SSLEngineFilterLayer.java:278)
at org.jenkinsci.remoting.protocol.impl.SSLEngineFilterLayer.processWrite(SSLEngineFilterLayer.java:502)
at org.jenkinsci.remoting.protocol.impl.SSLEngineFilterLayer.processQueuedWrites(SSLEngineFilterLayer.java:243)
at org.jenkinsci.remoting.protocol.impl.SSLEngineFilterLayer.doSend(SSLEngineFilterLayer.java:195)
at org.jenkinsci.remoting.protocol.impl.SSLEngineFilterLayer.doCloseSend(SSLEngineFilterLayer.java:208)
at org.jenkinsci.remoting.protocol.ProtocolStack$Ptr.doCloseSend(ProtocolStack.java:794)
at org.jenkinsci.remoting.protocol.ApplicationLayer.doCloseWrite(ApplicationLayer.java:172)
at org.jenkinsci.remoting.protocol.impl.ChannelApplicationLayer$ByteBufferCommandTransport.closeWrite(ChannelApplicationLayer.java:348)
at hudson.remoting.Channel.close(Channel.java:1619)
at hudson.remoting.Channel.close(Channel.java:1567)
at hudson.slaves.SlaveComputer.closeChannel(SlaveComputer.java:954)
at hudson.slaves.SlaveComputer.lambda$disconnect$1(SlaveComputer.java:825)
at jenkins.util.ContextResettingExecutorService.lambda$wrap$0(ContextResettingExecutorService.java:26)
at jenkins.security.ImpersonatingExecutorService.lambda$wrap$0(ImpersonatingExecutorService.java:66)
at jenkins.util.ErrorLoggingExecutorService.lambda$wrap$0(ErrorLoggingExecutorService.java:51)
at java.base/java.util.concurrent.Executors$RunnableAdapter.call(Executors.java:545)
at java.base/java.util.concurrent.FutureTask.run(FutureTask.java:328)
at java.base/java.util.concurrent.ThreadPoolExecutor.runWorker(ThreadPoolExecutor.java:1090)
at java.base/java.util.concurrent.ThreadPoolExecutor$Worker.run(ThreadPoolExecutor.java:614)
at java.base/java.lang.Thread.run(Thread.java:1474)
Caused: hudson.remoting.ChannelClosedException: Channel "hudson.remoting.Channel@17fa87f1:JNLP4-connect connection from lackey2.chi.freebsd.org/[2610:1c0:1040:607c:0:0:16:20]:24340": Remote call on JNLP4-connect connection from lackey2.chi.freebsd.org/[2610:1c0:1040:607c:0:0:16:20]:24340 failed. The channel is closing down or has closed down
at hudson.remoting.Channel.call(Channel.java:1101)
at hudson.FilePath.act(FilePath.java:1220)
at hudson.FilePath.act(FilePath.java:1209)
at hudson.FilePath.delete(FilePath.java:1756)
at hudson.tasks.CommandInterpreter.perform(CommandInterpreter.java:163)
at hudson.tasks.CommandInterpreter.perform(CommandInterpreter.java:92)
at hudson.tasks.BuildStepMonitor$1.perform(BuildStepMonitor.java:20)
at hudson.model.AbstractBuild$AbstractBuildExecution.perform(AbstractBuild.java:817)
at hudson.model.Build$BuildExecution.build(Build.java:199)
at hudson.model.Build$BuildExecution.doRun(Build.java:164)
at hudson.model.AbstractBuild$AbstractBuildExecution.run(AbstractBuild.java:526)
at hudson.model.Run.execute(Run.java:1849)
at hudson.model.FreeStyleBuild.run(FreeStyleBuild.java:44)
at hudson.model.ResourceController.execute(ResourceController.java:97)
at hudson.model.Executor.run(Executor.java:456)
Build step 'Execute shell' marked build as failure
ERROR: Step ‘Send build artifacts over FTP’ failed: no workspace for FreeBSD-main-amd64-build #37106
[PostBuildScript] - [INFO] Executing post build scripts.
[PostBuildScript] - [INFO] Build does not have any of the results [SUCCESS]. Did not execute build step #0.
[PostBuildScript] - [INFO] Executing post build scripts.
ERROR: Build step failed with exception
java.lang.NullPointerException: no workspace from node hudson.slaves.DumbSlave[lackey2.chi.freebsd.org] which is computer hudson.slaves.SlaveComputer@6954a629[lackey2.chi.freebsd.org] and has channel null
at hudson.tasks.CommandInterpreter.perform(CommandInterpreter.java:114)
at hudson.tasks.CommandInterpreter.perform(CommandInterpreter.java:92)
at PluginClassLoader for postbuildscript//org.jenkinsci.plugins.postbuildscript.processor.Processor.processBuildSteps(Processor.java:178)
at PluginClassLoader for postbuildscript//org.jenkinsci.plugins.postbuildscript.processor.Processor.processScripts(Processor.java:90)
at PluginClassLoader for postbuildscript//org.jenkinsci.plugins.postbuildscript.processor.Processor.process(Processor.java:78)
at PluginClassLoader for postbuildscript//org.jenkinsci.plugins.postbuildscript.processor.Processor.process(Processor.java:72)
at PluginClassLoader for postbuildscript//org.jenkinsci.plugins.postbuildscript.PostBuildScript.perform(PostBuildScript.java:76)
at hudson.tasks.BuildStepMonitor$1.perform(BuildStepMonitor.java:20)
at hudson.model.AbstractBuild$AbstractBuildExecution.perform(AbstractBuild.java:817)
at hudson.model.AbstractBuild$AbstractBuildExecution.performAllBuildSteps(AbstractBuild.java:766)
at hudson.model.Build$BuildExecution.post2(Build.java:179)
at hudson.model.AbstractBuild$AbstractBuildExecution.post(AbstractBuild.java:710)
at hudson.model.Run.execute(Run.java:1872)
at hudson.model.FreeStyleBuild.run(FreeStyleBuild.java:44)
at hudson.model.ResourceController.execute(ResourceController.java:97)
at hudson.model.Executor.run(Executor.java:456)
Build step 'Execute scripts' marked build as failure
Checking for post-build
Performing post-build step
Checking if email needs to be generated
Email was triggered for: Failure - Any
Sending email for trigger: Failure - Any
Sending mail from default account using System Admin e-mail address