FreeBSD-main-amd64-gcc14_build - Build #4939 - Still Failing

From: <jenkins-admin_at_FreeBSD.org>
Date: Wed, 14 Oct 2026 02:04:19 UTC
FreeBSD-main-amd64-gcc14_build - Build #4939 (064edc2ceb77389d17655c8aa347084e10d64add) - Still Failing

Build information: https://ci.FreeBSD.org/job/FreeBSD-main-amd64-gcc14_build/4939/
Full change log: https://ci.FreeBSD.org/job/FreeBSD-main-amd64-gcc14_build/4939/changes
Full build log: https://ci.FreeBSD.org/job/FreeBSD-main-amd64-gcc14_build/4939/console

Status explanation:
"Failure" - the build is suspected being broken by the following changes
"Still Failing" - the build has not been fixed by the following changes and
                  this is a notification to note that these changes have
                  not been fully tested by the CI system

Change summaries:
(Those commits are likely but not certainly responsible)

5efc40dd13a7ebd17fe79ab40a424ad894316675 by sjg:
safe_eval.sh: safe_set_var add allow list for values

064edc2ceb77389d17655c8aa347084e10d64add by sjg:
debug.sh avoid trouble from set -e



The end of the build log:

[...truncated 47.66 MiB...]
--- Commands/CommandObjectLog.pico ---
/usr/local/bin/x86_64-unknown-freebsd15.1-g++14  --sysroot=/tmp/obj/workspace/src/amd64.amd64/tmp -B/usr/local/x86_64-unknown-freebsd15.1/bin/ -fpic -DPIC  -UPIC -O2 -pipe -fno-common -I/workspace/src/contrib/llvm-project/lldb/include -I/workspace/src/contrib/llvm-project/lldb/source -I/tmp/obj/workspace/src/amd64.amd64/lib/clang/libllvm -I/tmp/obj/workspace/src/amd64.amd64/lib/clang/libclang -I/tmp/obj/workspace/src/amd64.amd64/lib/clang/liblldb -I/workspace/src/contrib/lua/src -I/workspace/src/lib/liblua -I/workspace/src/contrib/llvm-project/clang/include -DCLANG_ENABLE_STATIC_ANALYZER -I/workspace/src/lib/clang/include -I/workspace/src/contrib/llvm-project/llvm/include -D__STDC_CONSTANT_MACROS -D__STDC_FORMAT_MACROS -D__STDC_LIMIT_MACROS -DHAVE_VCS_VERSION_INC -DLLVM_DEFAULT_TARGET_TRIPLE=\"x86_64-unknown-freebsd16.0\" -DLLVM_HOST_TRIPLE=\"x86_64-unknown-freebsd16.0\" -DDEFAULT_SYSROOT=\"\" -DLLVM_TARGET_ENABLE_AARCH64 -DLLVM_TARGET_ENABLE_ARM -DLLVM_TARGET_ENABLE_POWERPC -DLLVM_TARGET_ENABLE_RISCV -DLLVM_TARGET_ENABLE_X86 -DLLVM_NATIVE_ASMPARSER=LLVMInitializeX86AsmParser -DLLVM_NATIVE_ASMPRINTER=LLVMInitializeX86AsmPrinter -DLLVM_NATIVE_DISASSEMBLER=LLVMInitializeX86Disassembler -DLLVM_NATIVE_TARGET=LLVMInitializeX86Target -DLLVM_NATIVE_TARGETINFO=LLVMInitializeX86TargetInfo -DLLVM_NATIVE_TARGETMC=LLVMInitializeX86TargetMC -ffunction-sections -fdata-sections -g1 -MD -MF.depend.Commands_CommandObjectLog.pico -MTCommands/CommandObjectLog.pico -Wno-format-zero-length -fstack-protector-strong -Wdate-time -Wno-error=address -Wno-error=array-bounds -Wno-error=attributes -Wno-error=bool-compare -Wno-error=cast-align -Wno-error=clobbered -Wno-error=deprecated-declarations -Wno-error=enum-compare -Wno-error=extra -Wno-error=logical-not-parentheses -Wno-error=strict-aliasing -Wno-error=uninitialized -Wno-error=unused-function -Wno-error=unused-value -Wno-error=empty-body -Wno-error=maybe-uninitialized -Wno-error=nonnull-compare -Wno-error=shift-negative-value -Wno-error=tautological-compare -Wno-error=unused-const-variable -Wno-error=bool-operation -Wno-error=deprecated -Wno-error=expansion-to-defined -Wno-error=format-overflow -Wno-error=format-truncation -Wno-error=implicit-fallthrough -Wno-error=int-in-bool-context -Wno-error=memset-elt-size -Wno-error=noexcept-type -Wno-error=nonnull -Wno-error=pointer-compare -Wno-error=stringop-overflow -Wno-error=aggressive-loop-optimizations -Wno-error=cast-function-type -Wno-error=catch-value -Wno-error=multistatement-macros -Wno-error=restrict -Wno-error=sizeof-pointer-memaccess -Wno-error=stringop-truncation -Wno-return-type -Wno-address-of-packed-member -fno-strict-aliasing   -fno-exceptions -fno-rtti -fvisibility-inlines-hidden -g1 -std=c++17  -Wno-attributes -Wno-deprecated-declarations -Wno-error=class-memaccess -Wno-literal-suffix -Wno-c++20-extensions -Wno-attributes -Wno-error=unknown-pragmas -Wno-dangling-reference        -c /workspace/src/contrib/llvm-project/lldb/source/Commands/CommandObjectLog.cpp -o Commands/CommandObjectLog.pico
--- Commands/CommandObjectMemory.pico ---
/usr/local/bin/x86_64-unknown-freebsd15.1-g++14  --sysroot=/tmp/obj/workspace/src/amd64.amd64/tmp -B/usr/local/x86_64-unknown-freebsd15.1/bin/ -fpic -DPIC  -UPIC -O2 -pipe -fno-common -I/workspace/src/contrib/llvm-project/lldb/include -I/workspace/src/contrib/llvm-project/lldb/source -I/tmp/obj/workspace/src/amd64.amd64/lib/clang/libllvm -I/tmp/obj/workspace/src/amd64.amd64/lib/clang/libclang -I/tmp/obj/workspace/src/amd64.amd64/lib/clang/liblldb -I/workspace/src/contrib/lua/src -I/workspace/src/lib/liblua -I/workspace/src/contrib/llvm-project/clang/include -DCLANG_ENABLE_STATIC_ANALYZER -I/workspace/src/lib/clang/include -I/workspace/src/contrib/llvm-project/llvm/include -D__STDC_CONSTANT_MACROS -D__STDC_FORMAT_MACROS -D__STDC_LIMIT_MACROS -DHAVE_VCS_VERSION_INC -DLLVM_DEFAULT_TARGET_TRIPLE=\"x86_64-unknown-freebsd16.0\" -DLLVM_HOST_TRIPLE=\"x86_64-unknown-freebsd16.0\" -DDEFAULT_SYSROOT=\"\" -DLLVM_TARGET_ENABLE_AARCH64 -DLLVM_TARGET_ENABLE_ARM -DLLVM_TARGET_ENABLE_POWERPC -DLLVM_TARGET_ENABLE_RISCV -DLLVM_TARGET_ENABLE_X86 -DLLVM_NATIVE_ASMPARSER=LLVMInitializeX86AsmParser -DLLVM_NATIVE_ASMPRINTER=LLVMInitializeX86AsmPrinter -DLLVM_NATIVE_DISASSEMBLER=LLVMInitializeX86Disassembler -DLLVM_NATIVE_TARGET=LLVMInitializeX86Target -DLLVM_NATIVE_TARGETINFO=LLVMInitializeX86TargetInfo -DLLVM_NATIVE_TARGETMC=LLVMInitializeX86TargetMC -ffunction-sections -fdata-sections -g1 -MD -MF.depend.Commands_CommandObjectMemory.pico -MTCommands/CommandObjectMemory.pico -Wno-format-zero-length -fstack-protector-strong -Wdate-time -Wno-error=address -Wno-error=array-bounds -Wno-error=attributes -Wno-error=bool-compare -Wno-error=cast-align -Wno-error=clobbered -Wno-error=deprecated-declarations -Wno-error=enum-compare -Wno-error=extra -Wno-error=logical-not-parentheses -Wno-error=strict-aliasing -Wno-error=uninitialized -Wno-error=unused-function -Wno-error=unused-value -Wno-error=empty-body -Wno-error=maybe-uninitialized -Wno-error=nonnull-compare -Wno-error=shift-negative-value -Wno-error=tautological-compare -Wno-error=unused-const-variable -Wno-error=bool-operation -Wno-error=deprecated -Wno-error=expansion-to-defined -Wno-error=format-overflow -Wno-error=format-truncation -Wno-error=implicit-fallthrough -Wno-error=int-in-bool-context -Wno-error=memset-elt-size -Wno-error=noexcept-type -Wno-error=nonnull -Wno-error=pointer-compare -Wno-error=stringop-overflow -Wno-error=aggressive-loop-optimizations -Wno-error=cast-function-type -Wno-error=catch-value -Wno-error=multistatement-macros -Wno-error=restrict -Wno-error=sizeof-pointer-memaccess -Wno-error=stringop-truncation -Wno-return-type -Wno-address-of-packed-member -fno-strict-aliasing   -fno-exceptions -fno-rtti -fvisibility-inlines-hidden -g1 -std=c++17  -Wno-attributes -Wno-deprecated-declarations -Wno-error=class-memaccess -Wno-literal-suffix -Wno-c++20-extensions -Wno-attributes -Wno-error=unknown-pragmas -Wno-dangling-reference        -c /workspace/src/contrib/llvm-project/lldb/source/Commands/CommandObjectMemory.cpp -o Commands/CommandObjectMemory.pico
--- Commands/CommandObjectMemoryTag.pico ---
/usr/local/bin/x86_64-unknown-freebsd15.1-g++14  --sysroot=/tmp/obj/workspace/src/amd64.amd64/tmp -B/usr/local/x86_64-unknown-freebsd15.1/bin/ -fpic -DPIC  -UPIC -O2 -pipe -fno-common -I/workspace/src/contrib/llvm-project/lldb/include -I/workspace/src/contrib/llvm-project/lldb/source -I/tmp/obj/workspace/src/amd64.amd64/lib/clang/libllvm -I/tmp/obj/workspace/src/amd64.amd64/lib/clang/libclang -I/tmp/obj/workspace/src/amd64.amd64/lib/clang/liblldb -I/workspace/src/contrib/lua/src -I/workspace/src/lib/liblua -I/workspace/src/contrib/llvm-project/clang/include -DCLANG_ENABLE_STATIC_ANALYZER -I/workspace/src/lib/clang/include -I/workspace/src/contrib/llvm-project/llvm/include -D__STDC_CONSTANT_MACROS -D__STDC_FORMAT_MACROS -D__STDC_LIMIT_MACROS -DHAVE_VCS_VERSION_INC -DLLVM_DEFAULT_TARGET_TRIPLE=\"x86_64-unknown-freebsd16.0\" -DLLVM_HOST_TRIPLE=\"x86_64-unknown-freebsd16.0\" -DDEFAULT_SYSROOT=\"\" -DLLVM_TARGET_ENABLE_AARCH64 -DLLVM_TARGET_ENABLE_ARM -DLLVM_TARGET_ENABLE_POWERPC -DLLVM_TARGET_ENABLE_RISCV -DLLVM_TARGET_ENABLE_X86 -DLLVM_NATIVE_ASMPARSER=LLVMInitializeX86AsmParser -DLLVM_NATIVE_ASMPRINTER=LLVMInitializeX86AsmPrinter -DLLVM_NATIVE_DISASSEMBLER=LLVMInitializeX86Disassembler -DLLVM_NATIVE_TARGET=LLVMInitializeX86Target -DLLVM_NATIVE_TARGETINFO=LLVMInitializeX86TargetInfo -DLLVM_NATIVE_TARGETMC=LLVMInitializeX86TargetMC -ffunction-sections -fdata-sections -g1 -MD -MF.depend.Commands_CommandObjectMemoryTag.pico -MTCommands/CommandObjectMemoryTag.pico -Wno-format-zero-length -fstack-protector-strong -Wdate-time -Wno-error=address -Wno-error=array-bounds -Wno-error=attributes -Wno-error=bool-compare -Wno-error=cast-align -Wno-error=clobbered -Wno-error=deprecated-declarations -Wno-error=enum-compare -Wno-error=extra -Wno-error=logical-not-parentheses -Wno-error=strict-aliasing -Wno-error=uninitialized -Wno-error=unused-function -Wno-error=unused-value -Wno-error=empty-body -Wno-error=maybe-uninitialized -Wno-error=nonnull-compare -Wno-error=shift-negative-value -Wno-error=tautological-compare -Wno-error=unused-const-variable -Wno-error=bool-operation -Wno-error=deprecated -Wno-error=expansion-to-defined -Wno-error=format-overflow -Wno-error=format-truncation -Wno-error=implicit-fallthrough -Wno-error=int-in-bool-context -Wno-error=memset-elt-size -Wno-error=noexcept-type -Wno-error=nonnull -Wno-error=pointer-compare -Wno-error=stringop-overflow -Wno-error=aggressive-loop-optimizations -Wno-error=cast-function-type -Wno-error=catch-value -Wno-error=multistatement-macros -Wno-error=restrict -Wno-error=sizeof-pointer-memaccess -Wno-error=stringop-truncation -Wno-return-type -Wno-address-of-packed-member -fno-strict-aliasing   -fno-exceptions -fno-rtti -fvisibility-inlines-hidden -g1 -std=c++17  -Wno-attributes -Wno-deprecated-declarations -Wno-error=class-memaccess -Wno-literal-suffix -Wno-c++20-extensions -Wno-attributes -Wno-error=unknown-pragmas -Wno-dangling-reference        -c /workspace/src/contrib/llvm-project/lldb/source/Commands/CommandObjectMemoryTag.cpp -o Commands/CommandObjectMemoryTag.pico
--- Commands/CommandObjectMultiword.pico ---
/usr/local/bin/x86_64-unknown-freebsd15.1-g++14  --sysroot=/tmp/obj/workspace/src/amd64.amd64/tmp -B/usr/local/x86_64-unknown-freebsd15.1/bin/ -fpic -DPIC  -UPIC -O2 -pipe -fno-common -I/workspace/src/contrib/llvm-project/lldb/include -I/workspace/src/contrib/llvm-project/lldb/source -I/tmp/obj/workspace/src/amd64.amd64/lib/clang/libllvm -I/tmp/obj/workspace/src/amd64.amd64/lib/clang/libclang -I/tmp/obj/workspace/src/amd64.amd64/lib/clang/liblldb -I/workspace/src/contrib/lua/src -I/workspace/src/lib/liblua -I/workspace/src/contrib/llvm-project/clang/include -DCLANG_ENABLE_STATIC_ANALYZER -I/workspace/src/lib/clang/include -I/workspace/src/contrib/llvm-project/llvm/include -D__STDC_CONSTANT_MACROS -D__STDC_FORMAT_MACROS -D__STDC_LIMIT_MACROS -DHAVE_VCS_VERSION_INC -DLLVM_DEFAULT_TARGET_TRIPLE=\"x86_64-unknown-freebsd16.0\" -DLLVM_HOST_TRIPLE=\"x86_64-unknown-freebsd16.0\" -DDEFAULT_SYSROOT=\"\" -DLLVM_TARGET_ENABLE_AARCH64 -DLLVM_TARGET_ENABLE_ARM -DLLVM_TARGET_ENABLE_POWERPC -DLLVM_TARGET_ENABLE_RISCV -DLLVM_TARGET_ENABLE_X86 -DLLVM_NATIVE_ASMPARSER=LLVMInitializeX86AsmParser -DLLVM_NATIVE_ASMPRINTER=LLVMInitializeX86AsmPrinter -DLLVM_NATIVE_DISASSEMBLER=LLVMInitializeX86Disassembler -DLLVM_NATIVE_TARGET=LLVMInitializeX86Target -DLLVM_NATIVE_TARGETINFO=LLVMInitializeX86TargetInfo -DLLVM_NATIVE_TARGETMC=LLVMInitializeX86TargetMC -ffunction-sections -fdata-sections -g1 -MD -MF.depend.Commands_CommandObjectMultiword.pico -MTCommands/CommandObjectMultiword.pico -Wno-format-zero-length -fstack-protector-strong -Wdate-time -Wno-error=address -Wno-error=array-bounds -Wno-error=attributes -Wno-error=bool-compare -Wno-error=cast-align -Wno-error=clobbered -Wno-error=deprecated-declarations -Wno-error=enum-compare -Wno-error=extra -Wno-error=logical-not-parentheses -Wno-error=strict-aliasing -Wno-error=uninitialized -Wno-error=unused-function -Wno-error=unused-value -Wno-error=empty-body -Wno-error=maybe-uninitialized -Wno-error=nonnull-compare -Wno-error=shift-negative-value -Wno-error=tautological-compare -Wno-error=unused-const-variable -Wno-error=bool-operation -Wno-error=deprecated -Wno-error=expansion-to-defined -Wno-error=format-overflow -Wno-error=format-truncation -Wno-error=implicit-fallthrough -Wno-error=int-in-bool-context -Wno-error=memset-elt-size -Wno-error=noexcept-type -Wno-error=nonnull -Wno-error=pointer-compare -Wno-error=stringop-overflow -Wno-error=aggressive-loop-optimizations -Wno-error=cast-function-type -Wno-error=catch-value -Wno-error=multistatement-macros -Wno-error=restrict -Wno-error=sizeof-pointer-memaccess -Wno-error=stringop-truncation -Wno-return-type -Wno-address-of-packed-member -fno-strict-aliasing   -fno-exceptions -fno-rtti -fvisibility-inlines-hidden -g1 -std=c++17  -Wno-attributes -Wno-deprecated-declarations -Wno-error=class-memaccess -Wno-literal-suffix -Wno-c++20-extensions -Wno-attributes -Wno-error=unknown-pragmas -Wno-dangling-reference        -c /workspace/src/contrib/llvm-project/lldb/source/Commands/CommandObjectMultiword.cpp -o Commands/CommandObjectMultiword.pico
--- Commands/CommandObjectPlatform.pico ---
/usr/local/bin/x86_64-unknown-freebsd15.1-g++14  --sysroot=/tmp/obj/workspace/src/amd64.amd64/tmp -B/usr/local/x86_64-unknown-freebsd15.1/bin/ -fpic -DPIC  -UPIC -O2 -pipe -fno-common -I/workspace/src/contrib/llvm-project/lldb/include -I/workspace/src/contrib/llvm-project/lldb/source -I/tmp/obj/workspace/src/amd64.amd64/lib/clang/libllvm -I/tmp/obj/workspace/src/amd64.amd64/lib/clang/libclang -I/tmp/obj/workspace/src/amd64.amd64/lib/clang/liblldb -I/workspace/src/contrib/lua/src -I/workspace/src/lib/liblua -I/workspace/src/contrib/llvm-project/clang/include -DCLANG_ENABLE_STATIC_ANALYZER -I/workspace/src/lib/clang/include -I/workspace/src/contrib/llvm-project/llvm/include -D__STDC_CONSTANT_MACROS -D__STDC_FORMAT_MACROS -D__STDC_LIMIT_MACROS -DHAVE_VCS_VERSION_INC -DLLVM_DEFAULT_TARGET_TRIPLE=\"x86_64-unknown-freebsd16.0\" -DLLVM_HOST_TRIPLE=\"x86_64-unknown-freebsd16.0\" -DDEFAULT_SYSROOT=\"\" -DLLVM_TARGET_ENABLE_AARCH64 -DLLVM_TARGET_ENABLE_ARM -DLLVM_TARGET_ENABLE_POWERPC -DLLVM_TARGET_ENABLE_RISCV -DLLVM_TARGET_ENABLE_X86 -DLLVM_NATIVE_ASMPARSER=LLVMInitializeX86AsmParser -DLLVM_NATIVE_ASMPRINTER=LLVMInitializeX86AsmPrinter -DLLVM_NATIVE_DISASSEMBLER=LLVMInitializeX86Disassembler -DLLVM_NATIVE_TARGET=LLVMInitializeX86Target -DLLVM_NATIVE_TARGETINFO=LLVMInitializeX86TargetInfo -DLLVM_NATIVE_TARGETMC=LLVMInitializeX86TargetMC -ffunction-sections -fdata-sections -g1 -MD -MF.depend.Commands_CommandObjectPlatform.pico -MTCommands/CommandObjectPlatform.pico -Wno-format-zero-length -fstack-protector-strong -Wdate-time -Wno-error=address -Wno-error=array-bounds -Wno-error=attributes -Wno-error=bool-compare -Wno-error=cast-align -Wno-error=clobbered -Wno-error=deprecated-declarations -Wno-error=enum-compare -Wno-error=extra -Wno-error=logical-not-parentheses -Wno-error=strict-aliasing -Wno-error=uninitialized -Wno-error=unused-function -Wno-error=unused-value -Wno-error=empty-body -Wno-error=maybe-uninitialized -Wno-error=nonnull-compare -Wno-error=shift-negative-value -Wno-error=tautological-compare -Wno-error=unused-const-variable -Wno-error=bool-operation -Wno-error=deprecated -Wno-error=expansion-to-defined -Wno-error=format-overflow -Wno-error=format-truncation -Wno-error=implicit-fallthrough -Wno-error=int-in-bool-context -Wno-error=memset-elt-size -Wno-error=noexcept-type -Wno-error=nonnull -Wno-error=pointer-compare -Wno-error=stringop-overflow -Wno-error=aggressive-loop-optimizations -Wno-error=cast-function-type -Wno-error=catch-value -Wno-error=multistatement-macros -Wno-error=restrict -Wno-error=sizeof-pointer-memaccess -Wno-error=stringop-truncation -Wno-return-type -Wno-address-of-packed-member -fno-strict-aliasing   -fno-exceptions -fno-rtti -fvisibility-inlines-hidden -g1 -std=c++17  -Wno-attributes -Wno-deprecated-declarations -Wno-error=class-memaccess -Wno-literal-suffix -Wno-c++20-extensions -Wno-attributes -Wno-error=unknown-pragmas -Wno-dangling-reference        -c /workspace/src/contrib/llvm-project/lldb/source/Commands/CommandObjectPlatform.cpp -o Commands/CommandObjectPlatform.pico
--- Commands/CommandObjectPlugin.pico ---
/usr/local/bin/x86_64-unknown-freebsd15.1-g++14  --sysroot=/tmp/obj/workspace/src/amd64.amd64/tmp -B/usr/local/x86_64-unknown-freebsd15.1/bin/ -fpic -DPIC  -UPIC -O2 -pipe -fno-common -I/workspace/src/contrib/llvm-project/lldb/include -I/workspace/src/contrib/llvm-project/lldb/source -I/tmp/obj/workspace/src/amd64.amd64/lib/clang/libllvm -I/tmp/obj/workspace/src/amd64.amd64/lib/clang/libclang -I/tmp/obj/workspace/src/amd64.amd64/lib/clang/liblldb -I/workspace/src/contrib/lua/src -I/workspace/src/lib/liblua -I/workspace/src/contrib/llvm-project/clang/include -DCLANG_ENABLE_STATIC_ANALYZER -I/workspace/src/lib/clang/include -I/workspace/src/contrib/llvm-project/llvm/include -D__STDC_CONSTANT_MACROS -D__STDC_FORMAT_MACROS -D__STDC_LIMIT_MACROS -DHAVE_VCS_VERSION_INC -DLLVM_DEFAULT_TARGET_TRIPLE=\"x86_64-unknown-freebsd16.0\" -DLLVM_HOST_TRIPLE=\"x86_64-unknown-freebsd16.0\" -DDEFAULT_SYSROOT=\"\" -DLLVM_TARGET_ENABLE_AARCH64 -DLLVM_TARGET_ENABLE_ARM -DLLVM_TARGET_ENABLE_POWERPC -DLLVM_TARGET_ENABLE_RISCV -DLLVM_TARGET_ENABLE_X86 -DLLVM_NATIVE_ASMPARSER=LLVMInitializeX86AsmParser -DLLVM_NATIVE_ASMPRINTER=LLVMInitializeX86AsmPrinter -DLLVM_NATIVE_DISASSEMBLER=LLVMInitializeX86Disassembler -DLLVM_NATIVE_TARGET=LLVMInitializeX86Target -DLLVM_NATIVE_TARGETINFO=LLVMInitializeX86TargetInfo -DLLVM_NATIVE_TARGETMC=LLVMInitializeX86TargetMC -ffunction-sections -fdata-sections -g1 -MD -MF.depend.Commands_CommandObjectPlugin.pico -MTCommands/CommandObjectPlugin.pico -Wno-format-zero-length -fstack-protector-strong -Wdate-time -Wno-error=address -Wno-error=array-bounds -Wno-error=attributes -Wno-error=bool-compare -Wno-error=cast-align -Wno-error=clobbered -Wno-error=deprecated-declarations -Wno-error=enum-compare -Wno-error=extra -Wno-error=logical-not-parentheses -Wno-error=strict-aliasing -Wno-error=uninitialized -Wno-error=unused-function -Wno-error=unused-value -Wno-error=empty-body -Wno-error=maybe-uninitialized -Wno-error=nonnull-compare -Wno-error=shift-negative-value -Wno-error=tautological-compare -Wno-error=unused-const-variable -Wno-error=bool-operation -Wno-error=deprecated -Wno-error=expansion-to-defined -Wno-error=format-overflow -Wno-error=format-truncation -Wno-error=implicit-fallthrough -Wno-error=int-in-bool-context -Wno-error=memset-elt-size -Wno-error=noexcept-type -Wno-error=nonnull -Wno-error=pointer-compare -Wno-error=stringop-overflow -Wno-error=aggressive-loop-optimizations -Wno-error=cast-function-type -Wno-error=catch-value -Wno-error=multistatement-macros -Wno-error=restrict -Wno-error=sizeof-pointer-memaccess -Wno-error=stringop-truncation -Wno-return-type -Wno-address-of-packed-member -fno-strict-aliasing   -fno-exceptions -fno-rtti -fvisibility-inlines-hidden -g1 -std=c++17  -Wno-attributes -Wno-deprecated-declarations -Wno-error=class-memaccess -Wno-literal-suffix -Wno-c++20-extensions -Wno-attributes -Wno-error=unknown-pragmas -Wno-dangling-reference        -c /workspace/src/contrib/llvm-project/lldb/source/Commands/CommandObjectPlugin.cpp -o Commands/CommandObjectPlugin.pico
--- Commands/CommandObjectProcess.pico ---
/usr/local/bin/x86_64-unknown-freebsd15.1-g++14  --sysroot=/tmp/obj/workspace/src/amd64.amd64/tmp -B/usr/local/x86_64-unknown-freebsd15.1/bin/ -fpic -DPIC  -UPIC -O2 -pipe -fno-common -I/workspace/src/contrib/llvm-project/lldb/include -I/workspace/src/contrib/llvm-project/lldb/source -I/tmp/obj/workspace/src/amd64.amd64/lib/clang/libllvm -I/tmp/obj/workspace/src/amd64.amd64/lib/clang/libclang -I/tmp/obj/workspace/src/amd64.amd64/lib/clang/liblldb -I/workspace/src/contrib/lua/src -I/workspace/src/lib/liblua -I/workspace/src/contrib/llvm-project/clang/include -DCLANG_ENABLE_STATIC_ANALYZER -I/workspace/src/lib/clang/include -I/workspace/src/contrib/llvm-project/llvm/include -D__STDC_CONSTANT_MACROS -D__STDC_FORMAT_MACROS -D__STDC_LIMIT_MACROS -DHAVE_VCS_VERSION_INC -DLLVM_DEFAULT_TARGET_TRIPLE=\"x86_64-unknown-freebsd16.0\" -DLLVM_HOST_TRIPLE=\"x86_64-unknown-freebsd16.0\" -DDEFAULT_SYSROOT=\"\" -DLLVM_TARGET_ENABLE_AARCH64 -DLLVM_TARGET_ENABLE_ARM -DLLVM_TARGET_ENABLE_POWERPC -DLLVM_TARGET_ENABLE_RISCV -DLLVM_TARGET_ENABLE_X86 -DLLVM_NATIVE_ASMPARSER=LLVMInitializeX86AsmParser -DLLVM_NATIVE_ASMPRINTER=LLVMInitializeX86AsmPrinter -DLLVM_NATIVE_DISASSEMBLER=LLVMInitializeX86Disassembler -DLLVM_NATIVE_TARGET=LLVMInitializeX86Target -DLLVM_NATIVE_TARGETINFO=LLVMInitializeX86TargetInfo -DLLVM_NATIVE_TARGETMC=LLVMInitializeX86TargetMC -ffunction-sections -fdata-sections -g1 -MD -MF.depend.Commands_CommandObjectProcess.pico -MTCommands/CommandObjectProcess.pico -Wno-format-zero-length -fstack-protector-strong -Wdate-time -Wno-error=address -Wno-error=array-bounds -Wno-error=attributes -Wno-error=bool-compare -Wno-error=cast-align -Wno-error=clobbered -Wno-error=deprecated-declarations -Wno-error=enum-compare -Wno-error=extra -Wno-error=logical-not-parentheses -Wno-error=strict-aliasing -Wno-error=uninitialized -Wno-error=unused-function -Wno-error=unused-value -Wno-error=empty-body -Wno-error=maybe-uninitialized -Wno-error=nonnull-compare -Wno-error=shift-negative-value -Wno-error=tautological-compare -Wno-error=unused-const-variable -Wno-error=bool-operation -Wno-error=deprecated -Wno-error=expansion-to-defined -Wno-error=format-overflow -Wno-error=format-truncation -Wno-error=implicit-fallthrough -Wno-error=int-in-bool-context -Wno-error=memset-elt-size -Wno-error=noexcept-type -Wno-error=nonnull -Wno-error=pointer-compare -Wno-error=stringop-overflow -Wno-error=aggressive-loop-optimizations -Wno-error=cast-function-type -Wno-error=catch-value -Wno-error=multistatement-macros -Wno-error=restrict -Wno-error=sizeof-pointer-memaccess -Wno-error=stringop-truncation -Wno-return-type -Wno-address-of-packed-member -fno-strict-aliasing   -fno-exceptions -fno-rtti -fvisibility-inlines-hidden -g1 -std=c++17  -Wno-attributes -Wno-deprecated-declarations -Wno-error=class-memaccess -Wno-literal-suffix -Wno-c++20-extensions -Wno-attributes -Wno-error=unknown-pragmas -Wno-dangling-reference        -c /workspace/src/contrib/llvm-project/lldb/source/Commands/CommandObjectProcess.cpp -o Commands/CommandObjectProcess.pico
--- Commands/CommandObjectProtocolServer.pico ---
/usr/local/bin/x86_64-unknown-freebsd15.1-g++14  --sysroot=/tmp/obj/workspace/src/amd64.amd64/tmp -B/usr/local/x86_64-unknown-freebsd15.1/bin/ -fpic -DPIC  -UPIC -O2 -pipe -fno-common -I/workspace/src/contrib/llvm-project/lldb/include -I/workspace/src/contrib/llvm-project/lldb/source -I/tmp/obj/workspace/src/amd64.amd64/lib/clang/libllvm -I/tmp/obj/workspace/src/amd64.amd64/lib/clang/libclang -I/tmp/obj/workspace/src/amd64.amd64/lib/clang/liblldb -I/workspace/src/contrib/lua/src -I/workspace/src/lib/liblua -I/workspace/src/contrib/llvm-project/clang/include -DCLANG_ENABLE_STATIC_ANALYZER -I/workspace/src/lib/clang/include -I/workspace/src/contrib/llvm-project/llvm/include -D__STDC_CONSTANT_MACROS -D__STDC_FORMAT_MACROS -D__STDC_LIMIT_MACROS -DHAVE_VCS_VERSION_INC -DLLVM_DEFAULT_TARGET_TRIPLE=\"x86_64-unknown-freebsd16.0\" -DLLVM_HOST_TRIPLE=\"x86_64-unknown-freebsd16.0\" -DDEFAULT_SYSROOT=\"\" -DLLVM_TARGET_ENABLE_AARCH64 -DLLVM_TARGET_ENABLE_ARM -DLLVM_TARGET_ENABLE_POWERPC -DLLVM_TARGET_ENABLE_RISCV -DLLVM_TARGET_ENABLE_X86 -DLLVM_NATIVE_ASMPARSER=LLVMInitializeX86AsmParser -DLLVM_NATIVE_ASMPRINTER=LLVMInitializeX86AsmPrinter -DLLVM_NATIVE_DISASSEMBLER=LLVMInitializeX86Disassembler -DLLVM_NATIVE_TARGET=LLVMInitializeX86Target -DLLVM_NATIVE_TARGETINFO=LLVMInitializeX86TargetInfo -DLLVM_NATIVE_TARGETMC=LLVMInitializeX86TargetMC -ffunction-sections -fdata-sections -g1 -MD -MF.depend.Commands_CommandObjectProtocolServer.pico -MTCommands/CommandObjectProtocolServer.pico -Wno-format-zero-length -fstack-protector-strong -Wdate-time -Wno-error=address -Wno-error=array-bounds -Wno-error=attributes -Wno-error=bool-compare -Wno-error=cast-align -Wno-error=clobbered -Wno-error=deprecated-declarations -Wno-error=enum-compare -Wno-error=extra -Wno-error=logical-not-parentheses -Wno-error=strict-aliasing -Wno-error=uninitialized -Wno-error=unused-function -Wno-error=unused-value -Wno-error=empty-body -Wno-error=maybe-uninitialized -Wno-error=nonnull-compare -Wno-error=shift-negative-value -Wno-error=tautological-compare -Wno-error=unused-const-variable -Wno-error=bool-operation -Wno-error=deprecated -Wno-error=expansion-to-defined -Wno-error=format-overflow -Wno-error=format-truncation -Wno-error=implicit-fallthrough -Wno-error=int-in-bool-context -Wno-error=memset-elt-size -Wno-error=noexcept-type -Wno-error=nonnull -Wno-error=pointer-compare -Wno-error=stringop-overflow -Wno-error=aggressive-loop-optimizations -Wno-error=cast-function-type -Wno-error=catch-value -Wno-error=multistatement-macros -Wno-error=restrict -Wno-error=sizeof-pointer-memaccess -Wno-error=stringop-truncation -Wno-return-type -Wno-address-of-packed-member -fno-strict-aliasing   -fno-exceptions -fno-rtti -fvisibility-inlines-hidden -g1 -std=c++17  -Wno-attributes -Wno-deprecated-declarations -Wno-error=class-memaccess -Wno-literal-suffix -Wno-c++20-extensions -Wno-attributes -Wno-error=unknown-pragmas -Wno-dangling-reference        -c /workspace/src/contrib/llvm-project/lldb/source/Commands/CommandObjectProtocolServer.cpp -o Commands/CommandObjectProtocolServer.pico
--- Commands/CommandObjectQuit.pico ---
/usr/local/bin/x86_64-unknown-freebsd15.1-g++14  --sysroot=/tmp/obj/workspace/src/amd64.amd64/tmp -B/usr/local/x86_64-unknown-freebsd15.1/bin/ -fpic -DPIC  -UPIC -O2 -pipe -fno-common -I/workspace/src/contrib/llvm-project/lldb/include -I/workspace/src/contrib/llvm-project/lldb/source -I/tmp/obj/workspace/src/amd64.amd64/lib/clang/libllvm -I/tmp/obj/workspace/src/amd64.amd64/lib/clang/libclang -I/tmp/obj/workspace/src/amd64.amd64/lib/clang/liblldb -I/workspace/src/contrib/lua/src -I/workspace/src/lib/liblua -I/workspace/src/contrib/llvm-project/clang/include -DCLANG_ENABLE_STATIC_ANALYZER -I/workspace/src/lib/clang/include -I/workspace/src/contrib/llvm-project/llvm/include -D__STDC_CONSTANT_MACROS -D__STDC_FORMAT_MACROS -D__STDC_LIMIT_MACROS -DHAVE_VCS_VERSION_INC -DLLVM_DEFAULT_TARGET_TRIPLE=\"x86_64-unknown-freebsd16.0\" -DLLVM_HOST_TRIPLE=\"x86_64-unknown-freebsd16.0\" -DDEFAULT_SYSROOT=\"\" -DLLVM_TARGET_ENABLE_AARCH64 -DLLVM_TARGET_ENABLE_ARM -DLLVM_TARGET_ENABLE_POWERPC -DLLVM_TARGET_ENABLE_RISCV -DLLVM_TARGET_ENABLE_X86 -DLLVM_NATIVE_ASMPARSER=LLVMInitializeX86AsmParser -DLLVM_NATIVE_ASMPRINTER=LLVMInitializeX86AsmPrinter -DLLVM_NATIVE_DISASSEMBLER=LLVMInitializeX86Disassembler -DLLVM_NATIVE_TARGET=LLVMInitializeX86Target -DLLVM_NATIVE_TARGETINFO=LLVMInitializeX86TargetInfo -DLLVM_NATIVE_TARGETMC=LLVMInitializeX86TargetMC -ffunction-sections -fdata-sections -g1 -MD -MF.depend.Commands_CommandObjectQuit.pico -MTCommands/CommandObjectQuit.pico -Wno-format-zero-length -fstack-protector-strong -Wdate-time -Wno-error=address -Wno-error=array-bounds -Wno-error=attributes -Wno-error=bool-compare -Wno-error=cast-align -Wno-error=clobbered -Wno-error=deprecated-declarations -Wno-error=enum-compare -Wno-error=extra -Wno-error=logical-not-parentheses -Wno-error=strict-aliasing -Wno-error=uninitialized -Wno-error=unused-function -Wno-error=unused-value -Wno-error=empty-body -Wno-error=maybe-uninitialized -Wno-error=nonnull-compare -Wno-error=shift-negative-value -Wno-error=tautological-compare -Wno-error=unused-const-variable -Wno-error=bool-operation -Wno-error=deprecated -Wno-error=expansion-to-defined -Wno-error=format-overflow -Wno-error=format-truncation -Wno-error=implicit-fallthrough -Wno-error=int-in-bool-context -Wno-error=memset-elt-size -Wno-error=noexcept-type -Wno-error=nonnull -Wno-error=pointer-compare -Wno-error=stringop-overflow -Wno-error=aggressive-loop-optimizations -Wno-error=cast-function-type -Wno-error=catch-value -Wno-error=multistatement-macros -Wno-error=restrict -Wno-error=sizeof-pointer-memaccess -Wno-error=stringop-truncation -Wno-return-type -Wno-address-of-packed-member -fno-strict-aliasing   -fno-exceptions -fno-rtti -fvisibility-inlines-hidden -g1 -std=c++17  -Wno-attributes -Wno-deprecated-declarations -Wno-error=class-memaccess -Wno-literal-suffix -Wno-c++20-extensions -Wno-attributes -Wno-error=unknown-pragmas -Wno-dangling-reference        -c /workspace/src/contrib/llvm-project/lldb/source/Commands/CommandObjectQuit.cpp -o Commands/CommandObjectQuit.pico
--- Commands/CommandObjectRegexCommand.pico ---
/usr/local/bin/x86_64-unknown-freebsd15.1-g++14  --sysroot=/tmp/obj/workspace/src/amd64.amd64/tmp -B/usr/local/x86_64-unknown-freebsd15.1/bin/ -fpic -DPIC  -UPIC -O2 -pipe -fno-common -I/workspace/src/contrib/llvm-project/lldb/include -I/workspace/src/contrib/llvm-project/lldb/source -I/tmp/obj/workspace/src/amd64.amd64/lib/clang/libllvm -I/tmp/obj/workspace/src/amd64.amd64/lib/clang/libclang -I/tmp/obj/workspace/src/amd64.amd64/lib/clang/liblldb -I/workspace/src/contrib/lua/src -I/workspace/src/lib/liblua -I/workspace/src/contrib/llvm-project/clang/include -DCLANG_ENABLE_STATIC_ANALYZER -I/workspace/src/lib/clang/include -I/workspace/src/contrib/llvm-project/llvm/include -D__STDC_CONSTANT_MACROS -D__STDC_FORMAT_MACROS -D__STDC_LIMIT_MACROS -DHAVE_VCS_VERSION_INC -DLLVM_DEFAULT_TARGET_TRIPLE=\"x86_64-unknown-freebsd16.0\" -DLLVM_HOST_TRIPLE=\"x86_64-unknown-freebsd16.0\" -DDEFAULT_SYSROOT=\"\" -DLLVM_TARGET_ENABLE_AARCH64 -DLLVM_TARGET_ENABLE_ARM -DLLVM_TARGET_ENABLE_POWERPC -DLLVM_TARGET_ENABLE_RISCV -DLLVM_TARGET_ENABLE_X86 -DLLVM_NATIVE_ASMPARSER=LLVMInitializeX86AsmParser -DLLVM_NATIVE_ASMPRINTER=LLVMInitializeX86AsmPrinter -DLLVM_NATIVE_DISASSEMBLER=LLVMInitializeX86Disassembler -DLLVM_NATIVE_TARGET=LLVMInitializeX86Target -DLLVM_NATIVE_TARGETINFO=LLVMInitializeX86TargetInfo -DLLVM_NATIVE_TARGETMC=LLVMInitializeX86TargetMC -ffunction-sections -fdata-sections -g1 -MD -MF.depend.Commands_CommandObjectRegexCommand.pico -MTCommands/CommandObjectRegexCommand.pico -Wno-format-zero-length -fstack-protector-strong -Wdate-time -Wno-error=address -Wno-error=array-bounds -Wno-error=attributes -Wno-error=bool-compare -Wno-error=cast-align -Wno-error=clobbered -Wno-error=deprecated-declarations -Wno-error=enum-compare -Wno-error=extra -Wno-error=logical-not-parentheses -Wno-error=strict-aliasing -Wno-error=uninitialized -Wno-error=unused-function -Wno-error=unused-value -Wno-error=empty-body -Wno-error=maybe-uninitialized -Wno-error=nonnull-compare -Wno-error=shift-negative-value -Wno-error=tautological-compare -Wno-error=unused-const-variable -Wno-error=bool-operation -Wno-error=deprecated -Wno-error=expansion-to-defined -Wno-error=format-overflow -Wno-error=format-truncation -Wno-error=implicit-fallthrough -Wno-error=int-in-bool-context -Wno-error=memset-elt-size -Wno-error=noexcept-type -Wno-error=nonnull -Wno-error=pointer-compare -Wno-error=stringop-overflow -Wno-error=aggressive-loop-optimizations -Wno-error=cast-function-type -Wno-error=catch-value -Wno-error=multistatement-macros -Wno-error=restrict -Wno-error=sizeof-pointer-memaccess -Wno-error=stringop-truncation -Wno-return-type -Wno-address-of-packed-member -fno-strict-aliasing   -fno-exceptions -fno-rtti -fvisibility-inlines-hidden -g1 -std=c++17  -Wno-attributes -Wno-deprecated-declarations -Wno-error=class-memaccess -Wno-literal-suffix -Wno-c++20-extensions -Wno-attributes -Wno-error=unknown-pragmas -Wno-dangling-reference        -c /workspace/src/contrib/llvm-project/lldb/source/Commands/CommandObjectRegexCommand.cpp -o Commands/CommandObjectRegexCommand.pico
--- Commands/CommandObjectRegister.pico ---
/usr/local/bin/x86_64-unknown-freebsd15.1-g++14  --sysroot=/tmp/obj/workspace/src/amd64.amd64/tmp -B/usr/local/x86_64-unknown-freebsd15.1/bin/ -fpic -DPIC  -UPIC -O2 -pipe -fno-common -I/workspace/src/contrib/llvm-project/lldb/include -I/workspace/src/contrib/llvm-project/lldb/source -I/tmp/obj/workspace/src/amd64.amd64/lib/clang/libllvm -I/tmp/obj/workspace/src/amd64.amd64/lib/clang/libclang -I/tmp/obj/workspace/src/amd64.amd64/lib/clang/liblldb -I/workspace/src/contrib/lua/src -I/workspace/src/lib/liblua -I/workspace/src/contrib/llvm-project/clang/include -DCLANG_ENABLE_STATIC_ANALYZER -I/workspace/src/lib/clang/include -I/workspace/src/contrib/llvm-project/llvm/include -D__STDC_CONSTANT_MACROS -D__STDC_FORMAT_MACROS -D__STDC_LIMIT_MACROS -DHAVE_VCS_VERSION_INC -DLLVM_DEFAULT_TARGET_TRIPLE=\"x86_64-unknown-freebsd16.0\" -DLLVM_HOST_TRIPLE=\"x86_64-unknown-freebsd16.0\" -DDEFAULT_SYSROOT=\"\" -DLLVM_TARGET_ENABLE_AARCH64 -DLLVM_TARGET_ENABLE_ARM -DLLVM_TARGET_ENABLE_POWERPC -DLLVM_TARGET_ENABLE_RISCV -DLLVM_TARGET_ENABLE_X86 -DLLVM_NATIVE_ASMPARSER=LLVMInitializeX86AsmParser -DLLVM_NATIVE_ASMPRINTER=LLVMInitializeX86AsmPrinter -DLLVM_NATIVE_DISASSEMBLER=LLVMInitializeX86Disassembler -DLLVM_NATIVE_TARGET=LLVMInitializeX86Target -DLLVM_NATIVE_TARGETINFO=LLVMInitializeX86TargetInfo -DLLVM_NATIVE_TARGETMC=LLVMInitializeX86TargetMC -ffunction-sections -fdata-sections -g1 -MD -MF.depend.Commands_CommandObjectRegister.pico -MTCommands/CommandObjectRegister.pico -Wno-format-zero-length -fstack-protector-strong -Wdate-time -Wno-error=address -Wno-error=array-bounds -Wno-error=attributes -Wno-error=bool-compare -Wno-error=cast-align -Wno-error=clobbered -Wno-error=deprecated-declarations -Wno-error=enum-compare -Wno-error=extra -Wno-error=logical-not-parentheses -Wno-error=strict-aliasing -Wno-error=uninitialized -Wno-error=unused-function -Wno-error=unused-value -Wno-error=empty-body -Wno-error=maybe-uninitialized -Wno-error=nonnull-compare -Wno-error=shift-negative-value -Wno-error=tautological-compare -Wno-error=unused-const-variable -Wno-error=bool-operation -Wno-error=deprecated -Wno-error=expansion-to-defined -Wno-error=format-overflow -Wno-error=format-truncation -Wno-error=implicit-fallthrough -Wno-error=int-in-bool-context -Wno-error=memset-elt-size -Wno-error=noexcept-type -Wno-error=nonnull -Wno-error=pointer-compare -Wno-error=stringop-overflow -Wno-error=aggressive-loop-optimizations -Wno-error=cast-function-type -Wno-error=catch-value -Wno-error=multistatement-macros -Wno-error=restrict -Wno-error=sizeof-pointer-memaccess -Wno-error=stringop-truncation -Wno-return-type -Wno-address-of-packed-member -fno-strict-aliasing   -fno-exceptions -fno-rtti -fvisibility-inlines-hidden -g1 -std=c++17  -Wno-attributes -Wno-deprecated-declarations -Wno-error=class-memaccess -Wno-literal-suffix -Wno-c++20-extensions -Wno-attributes -Wno-error=unknown-pragmas -Wno-dangling-reference        -c /workspace/src/contrib/llvm-project/lldb/source/Commands/CommandObjectRegister.cpp -o Commands/CommandObjectRegister.pico
--- Commands/CommandObjectScripting.pico ---
/usr/local/bin/x86_64-unknown-freebsd15.1-g++14  --sysroot=/tmp/obj/workspace/src/amd64.amd64/tmp -B/usr/local/x86_64-unknown-freebsd15.1/bin/ -fpic -DPIC  -UPIC -O2 -pipe -fno-common -I/workspace/src/contrib/llvm-project/lldb/include -I/workspace/src/contrib/llvm-project/lldb/source -I/tmp/obj/workspace/src/amd64.amd64/lib/clang/libllvm -I/tmp/obj/workspace/src/amd64.amd64/lib/clang/libclang -I/tmp/obj/workspace/src/amd64.amd64/lib/clang/liblldb -I/workspace/src/contrib/lua/src -I/workspace/src/lib/liblua -I/workspace/src/contrib/llvm-project/clang/include -DCLANG_ENABLE_STATIC_ANALYZER -I/workspace/src/lib/clang/include -I/workspace/src/contrib/llvm-project/llvm/include -D__STDC_CONSTANT_MACROS -D__STDC_FORMAT_MACROS -D__STDC_LIMIT_MACROS -DHAVE_VCS_VERSION_INC -DLLVM_DEFAULT_TARGET_TRIPLE=\"x86_64-unknown-freebsd16.0\" -DLLVM_HOST_TRIPLE=\"x86_64-unknown-freebsd16.0\" -DDEFAULT_SYSROOT=\"\" -DLLVM_TARGET_ENABLE_AARCH64 -DLLVM_TARGET_ENABLE_ARM -DLLVM_TARGET_ENABLE_POWERPC -DLLVM_TARGET_ENABLE_RISCV -DLLVM_TARGET_ENABLE_X86 -DLLVM_NATIVE_ASMPARSER=LLVMInitializeX86AsmParser -DLLVM_NATIVE_ASMPRINTER=LLVMInitializeX86AsmPrinter -DLLVM_NATIVE_DISASSEMBLER=LLVMInitializeX86Disassembler -DLLVM_NATIVE_TARGET=LLVMInitializeX86Target -DLLVM_NATIVE_TARGETINFO=LLVMInitializeX86TargetInfo -DLLVM_NATIVE_TARGETMC=LLVMInitializeX86TargetMC -ffunction-sections -fdata-sections -g1 -MD -MF.depend.Commands_CommandObjectScripting.pico -MTCommands/CommandObjectScripting.pico -Wno-format-zero-length -fstack-protector-strong -Wdate-time -Wno-error=address -Wno-error=array-bounds -Wno-error=attributes -Wno-error=bool-compare -Wno-error=cast-align -Wno-error=clobbered -Wno-error=deprecated-declarations -Wno-error=enum-compare -Wno-error=extra -Wno-error=logical-not-parentheses -Wno-error=strict-aliasing -Wno-error=uninitialized -Wno-error=unused-function -Wno-error=unused-value -Wno-error=empty-body -Wno-error=maybe-uninitialized -Wno-error=nonnull-compare -Wno-error=shift-negative-value -Wno-error=tautological-compare -Wno-error=unused-const-variable -Wno-error=bool-operation -Wno-error=deprecated -Wno-error=expansion-to-defined -Wno-error=format-overflow -Wno-error=format-truncation -Wno-error=implicit-fallthrough -Wno-error=int-in-bool-context -Wno-error=memset-elt-size -Wno-error=noexcept-type -Wno-error=nonnull -Wno-error=pointer-compare -Wno-error=stringop-overflow -Wno-error=aggressive-loop-optimizations -Wno-error=cast-function-type -Wno-error=catch-value -Wno-error=multistatement-macros -Wno-error=restrict -Wno-error=sizeof-pointer-memaccess -Wno-error=stringop-truncation -Wno-return-type -Wno-address-of-packed-member -fno-strict-aliasing   -fno-exceptions -fno-rtti -fvisibility-inlines-hidden -g1 -std=c++17  -Wno-attributes -Wno-deprecated-declarations -Wno-error=class-memaccess -Wno-literal-suffix -Wno-c++20-extensions -Wno-attributes -Wno-error=unknown-pragmas -Wno-dangling-reference        -c /workspace/src/contrib/llvm-project/lldb/source/Commands/CommandObjectScripting.cpp -o Commands/CommandObjectScripting.pico
--- Commands/CommandObjectSession.pico ---
/usr/local/bin/x86_64-unknown-freebsd15.1-g++14  --sysroot=/tmp/obj/workspace/src/amd64.amd64/tmp -B/usr/local/x86_64-unknown-freebsd15.1/bin/ -fpic -DPIC  -UPIC -O2 -pipe -fno-common -I/workspace/src/contrib/llvm-project/lldb/include -I/workspace/src/contrib/llvm-project/lldb/source -I/tmp/obj/workspace/src/amd64.amd64/lib/clang/libllvm -I/tmp/obj/workspace/src/amd64.amd64/lib/clang/libclang -I/tmp/obj/workspace/src/amd64.amd64/lib/clang/liblldb -I/workspace/src/contrib/lua/src -I/workspace/src/lib/liblua -I/workspace/src/contrib/llvm-project/clang/include -DCLANG_ENABLE_STATIC_ANALYZER -I/workspace/src/lib/clang/include -I/workspace/src/contrib/llvm-project/llvm/include -D__STDC_CONSTANT_MACROS -D__STDC_FORMAT_MACROS -D__STDC_LIMIT_MACROS -DHAVE_VCS_VERSION_INC -DLLVM_DEFAULT_TARGET_TRIPLE=\"x86_64-unknown-freebsd16.0\" -DLLVM_HOST_TRIPLE=\"x86_64-unknown-freebsd16.0\" -DDEFAULT_SYSROOT=\"\" -DLLVM_TARGET_ENABLE_AARCH64 -DLLVM_TARGET_ENABLE_ARM -DLLVM_TARGET_ENABLE_POWERPC -DLLVM_TARGET_ENABLE_RISCV -DLLVM_TARGET_ENABLE_X86 -DLLVM_NATIVE_ASMPARSER=LLVMInitializeX86AsmParser -DLLVM_NATIVE_ASMPRINTER=LLVMInitializeX86AsmPrinter -DLLVM_NATIVE_DISASSEMBLER=LLVMInitializeX86Disassembler -DLLVM_NATIVE_TARGET=LLVMInitializeX86Target -DLLVM_NATIVE_TARGETINFO=LLVMInitializeX86TargetInfo -DLLVM_NATIVE_TARGETMC=LLVMInitializeX86TargetMC -ffunction-sections -fdata-sections -g1 -MD -MF.depend.Commands_CommandObjectSession.pico -MTCommands/CommandObjectSession.pico -Wno-format-zero-length -fstack-protector-strong -Wdate-time -Wno-error=address -Wno-error=array-bounds -Wno-error=attributes -Wno-error=bool-compare -Wno-error=cast-align -Wno-error=clobbered -Wno-error=deprecated-declarations -Wno-error=enum-compare -Wno-error=extra -Wno-error=logical-not-parentheses -Wno-error=strict-aliasing -Wno-error=uninitialized -Wno-error=unused-function -Wno-error=unused-value -Wno-error=empty-body -Wno-error=maybe-uninitialized -Wno-error=nonnull-compare -Wno-error=shift-negative-value -Wno-error=tautological-compare -Wno-error=unused-const-variable -Wno-error=bool-operation -Wno-error=deprecated -Wno-error=expansion-to-defined -Wno-error=format-overflow -Wno-error=format-truncation -Wno-error=implicit-fallthrough -Wno-error=int-in-bool-context -Wno-error=memset-elt-size -Wno-error=noexcept-type -Wno-error=nonnull -Wno-error=pointer-compare -Wno-error=stringop-overflow -Wno-error=aggressive-loop-optimizations -Wno-error=cast-function-type -Wno-error=catch-value -Wno-error=multistatement-macros -Wno-error=restrict -Wno-error=sizeof-pointer-memaccess -Wno-error=stringop-truncation -Wno-return-type -Wno-address-of-packed-member -fno-strict-aliasing   -fno-exceptions -fno-rtti -fvisibility-inlines-hidden -g1 -std=c++17  -Wno-attributes -Wno-deprecated-declarations -Wno-error=class-memaccess -Wno-literal-suffix -Wno-c++20-extensions -Wno-attributes -Wno-error=unknown-pragmas -Wno-dangling-reference        -c /workspace/src/contrib/llvm-project/lldb/source/Commands/CommandObjectSession.cpp -o Commands/CommandObjectSession.pico
--- Commands/CommandObjectSettings.pico ---
/usr/local/bin/x86_64-unknown-freebsd15.1-g++14  --sysroot=/tmp/obj/workspace/src/amd64.amd64/tmp -B/usr/local/x86_64-unknown-freebsd15.1/bin/ -fpic -DPIC  -UPIC -O2 -pipe -fno-common -I/workspace/src/contrib/llvm-project/lldb/include -I/workspace/src/contrib/llvm-project/lldb/source -I/tmp/obj/workspace/src/amd64.amd64/lib/clang/libllvm -I/tmp/obj/workspace/src/amd64.amd64/lib/clang/libclang -I/tmp/obj/workspace/src/amd64.amd64/lib/clang/liblldb -I/workspace/src/contrib/lua/src -I/workspace/src/lib/liblua -I/workspace/src/contrib/llvm-project/clang/include -DCLANG_ENABLE_STATIC_ANALYZER -I/workspace/src/lib/clang/include -I/workspace/src/contrib/llvm-project/llvm/include -D__STDC_CONSTANT_MACROS -D__STDC_FORMAT_MACROS -D__STDC_LIMIT_MACROS -DHAVE_VCS_VERSION_INC -DLLVM_DEFAULT_TARGET_TRIPLE=\"x86_64-unknown-freebsd16.0\" -DLLVM_HOST_TRIPLE=\"x86_64-unknown-freebsd16.0\" -DDEFAULT_SYSROOT=\"\" -DLLVM_TARGET_ENABLE_AARCH64 -DLLVM_TARGET_ENABLE_ARM -DLLVM_TARGET_ENABLE_POWERPC -DLLVM_TARGET_ENABLE_RISCV -DLLVM_TARGET_ENABLE_X86 -DLLVM_NATIVE_ASMPARSER=LLVMInitializeX86AsmParser -DLLVM_NATIVE_ASMPRINTER=LLVMInitializeX86AsmPrinter -DLLVM_NATIVE_DISASSEMBLER=LLVMInitializeX86Disassembler -DLLVM_NATIVE_TARGET=LLVMInitializeX86Target -DLLVM_NATIVE_TARGETINFO=LLVMInitializeX86TargetInfo -DLLVM_NATIVE_TARGETMC=LLVMInitializeX86TargetMC -ffunction-sections -fdata-sections -g1 -MD -MF.depend.Commands_CommandObjectSettings.pico -MTCommands/CommandObjectSettings.pico -Wno-format-zero-length -fstack-protector-strong -Wdate-time -Wno-error=address -Wno-error=array-bounds -Wno-error=attributes -Wno-error=bool-compare -Wno-error=cast-align -Wno-error=clobbered -Wno-error=deprecated-declarations -Wno-error=enum-compare -Wno-error=extra -Wno-error=logical-not-parentheses -Wno-error=strict-aliasing -Wno-error=uninitialized -Wno-error=unused-function -Wno-error=unused-value -Wno-error=empty-body -Wno-error=maybe-uninitialized -Wno-error=nonnull-compare -Wno-error=shift-negative-value -Wno-error=tautological-compare -Wno-error=unused-const-variable -Wno-error=bool-operation -Wno-error=deprecated -Wno-error=expansion-to-defined -Wno-error=format-overflow -Wno-error=format-truncation -Wno-error=implicit-fallthrough -Wno-error=int-in-bool-context -Wno-error=memset-elt-size -Wno-error=noexcept-type -Wno-error=nonnull -Wno-error=pointer-compare -Wno-error=stringop-overflow -Wno-error=aggressive-loop-optimizations -Wno-error=cast-function-type -Wno-error=catch-value -Wno-error=multistatement-macros -Wno-error=restrict -Wno-error=sizeof-pointer-memaccess -Wno-error=stringop-truncation -Wno-return-type -Wno-address-of-packed-member -fno-strict-aliasing   -fno-exceptions -fno-rtti -fvisibility-inlines-hidden -g1 -std=c++17  -Wno-attributes -Wno-deprecated-declarations -Wno-error=class-memaccess -Wno-literal-suffix -Wno-c++20-extensions -Wno-attributes -Wno-error=unknown-pragmas -Wno-dangling-reference        -c /workspace/src/contrib/llvm-project/lldb/source/Commands/CommandObjectSettings.cpp -o Commands/CommandObjectSettings.pico
--- Commands/CommandObjectSource.pico ---
/usr/local/bin/x86_64-unknown-freebsd15.1-g++14  --sysroot=/tmp/obj/workspace/src/amd64.amd64/tmp -B/usr/local/x86_64-unknown-freebsd15.1/bin/ -fpic -DPIC  -UPIC -O2 -pipe -fno-common -I/workspace/src/contrib/llvm-project/lldb/include -I/workspace/src/contrib/llvm-project/lldb/source -I/tmp/obj/workspace/src/amd64.amd64/lib/clang/libllvm -I/tmp/obj/workspace/src/amd64.amd64/lib/clang/libclang -I/tmp/obj/workspace/src/amd64.amd64/lib/clang/liblldb -I/workspace/src/contrib/lua/src -I/workspace/src/lib/liblua -I/workspace/src/contrib/llvm-project/clang/include -DCLANG_ENABLE_STATIC_ANALYZER -I/workspace/src/lib/clang/include -I/workspace/src/contrib/llvm-project/llvm/include -D__STDC_CONSTANT_MACROS -D__STDC_FORMAT_MACROS -D__STDC_LIMIT_MACROS -DHAVE_VCS_VERSION_INC -DLLVM_DEFAULT_TARGET_TRIPLE=\"x86_64-unknown-freebsd16.0\" -DLLVM_HOST_TRIPLE=\"x86_64-unknown-freebsd16.0\" -DDEFAULT_SYSROOT=\"\" -DLLVM_TARGET_ENABLE_AARCH64 -DLLVM_TARGET_ENABLE_ARM -DLLVM_TARGET_ENABLE_POWERPC -DLLVM_TARGET_ENABLE_RISCV -DLLVM_TARGET_ENABLE_X86 -DLLVM_NATIVE_ASMPARSER=LLVMInitializeX86AsmParser -DLLVM_NATIVE_ASMPRINTER=LLVMInitializeX86AsmPrinter -DLLVM_NATIVE_DISASSEMBLER=LLVMInitializeX86Disassembler -DLLVM_NATIVE_TARGET=LLVMInitializeX86Target -DLLVM_NATIVE_TARGETINFO=LLVMInitializeX86TargetInfo -DLLVM_NATIVE_TARGETMC=LLVMInitializeX86TargetMC -ffunction-sections -fdata-sections -g1 -MD -MF.depend.Commands_CommandObjectSource.pico -MTCommands/CommandObjectSource.pico -Wno-format-zero-length -fstack-protector-strong -Wdate-time -Wno-error=address -Wno-error=array-bounds -Wno-error=attributes -Wno-error=bool-compare -Wno-error=cast-align -Wno-error=clobbered -Wno-error=deprecated-declarations -Wno-error=enum-compare -Wno-error=extra -Wno-error=logical-not-parentheses -Wno-error=strict-aliasing -Wno-error=uninitialized -Wno-error=unused-function -Wno-error=unused-value -Wno-error=empty-body -Wno-error=maybe-uninitialized -Wno-error=nonnull-compare -Wno-error=shift-negative-value -Wno-error=tautological-compare -Wno-error=unused-const-variable -Wno-error=bool-operation -Wno-error=deprecated -Wno-error=expansion-to-defined -Wno-error=format-overflow -Wno-error=format-truncation -Wno-error=implicit-fallthrough -Wno-error=int-in-bool-context -Wno-error=memset-elt-size -Wno-error=noexcept-type -Wno-error=nonnull -Wno-error=pointer-compare -Wno-error=stringop-overflow -Wno-error=aggressive-loop-optimizations -Wno-error=cast-function-type -Wno-error=catch-value -Wno-error=multistatement-macros -Wno-error=restrict -Wno-error=sizeof-pointer-memaccess -Wno-error=stringop-truncation -Wno-return-type -Wno-address-of-packed-member -fno-strict-aliasing   -fno-exceptions -fno-rtti -fvisibility-inlines-hidden -g1 -std=c++17  -Wno-attributes -Wno-deprecated-declarations -Wno-error=class-memaccess -Wno-literal-suffix -Wno-c++20-extensions -Wno-attributes -Wno-error=unknown-pragmas -Wno-dangling-reference        -c /workspace/src/contrib/llvm-project/lldb/source/Commands/CommandObjectSource.cpp -o Commands/CommandObjectSource.pico
--- Commands/CommandObjectStats.pico ---
/usr/local/bin/x86_64-unknown-freebsd15.1-g++14  --sysroot=/tmp/obj/workspace/src/amd64.amd64/tmp -B/usr/local/x86_64-unknown-freebsd15.1/bin/ -fpic -DPIC  -UPIC -O2 -pipe -fno-common -I/workspace/src/contrib/llvm-project/lldb/include -I/workspace/src/contrib/llvm-project/lldb/source -I/tmp/obj/workspace/src/amd64.amd64/lib/clang/libllvm -I/tmp/obj/workspace/src/amd64.amd64/lib/clang/libclang -I/tmp/obj/workspace/src/amd64.amd64/lib/clang/liblldb -I/workspace/src/contrib/lua/src -I/workspace/src/lib/liblua -I/workspace/src/contrib/llvm-project/clang/include -DCLANG_ENABLE_STATIC_ANALYZER -I/workspace/src/lib/clang/include -I/workspace/src/contrib/llvm-project/llvm/include -D__STDC_CONSTANT_MACROS -D__STDC_FORMAT_MACROS -D__STDC_LIMIT_MACROS -DHAVE_VCS_VERSION_INC -DLLVM_DEFAULT_TARGET_TRIPLE=\"x86_64-unknown-freebsd16.0\" -DLLVM_HOST_TRIPLE=\"x86_64-unknown-freebsd16.0\" -DDEFAULT_SYSROOT=\"\" -DLLVM_TARGET_ENABLE_AARCH64 -DLLVM_TARGET_ENABLE_ARM -DLLVM_TARGET_ENABLE_POWERPC -DLLVM_TARGET_ENABLE_RISCV -DLLVM_TARGET_ENABLE_X86 -DLLVM_NATIVE_ASMPARSER=LLVMInitializeX86AsmParser -DLLVM_NATIVE_ASMPRINTER=LLVMInitializeX86AsmPrinter -DLLVM_NATIVE_DISASSEMBLER=LLVMInitializeX86Disassembler -DLLVM_NATIVE_TARGET=LLVMInitializeX86Target -DLLVM_NATIVE_TARGETINFO=LLVMInitializeX86TargetInfo -DLLVM_NATIVE_TARGETMC=LLVMInitializeX86TargetMC -ffunction-sections -fdata-sections -g1 -MD -MF.depend.Commands_CommandObjectStats.pico -MTCommands/CommandObjectStats.pico -Wno-format-zero-length -fstack-protector-strong -Wdate-time -Wno-error=address -Wno-error=array-bounds -Wno-error=attributes -Wno-error=bool-compare -Wno-error=cast-align -Wno-error=clobbered -Wno-error=deprecated-declarations -Wno-error=enum-compare -Wno-error=extra -Wno-error=logical-not-parentheses -Wno-error=strict-aliasing -Wno-error=uninitialized -Wno-error=unused-function -Wno-error=unused-value -Wno-error=empty-body -Wno-error=maybe-uninitialized -Wno-error=nonnull-compare -Wno-error=shift-negative-value -Wno-error=tautological-compare -Wno-error=unused-const-variable -Wno-error=bool-operation -Wno-error=deprecated -Wno-error=expansion-to-defined -Wno-error=format-overflow -Wno-error=format-truncation -Wno-error=implicit-fallthrough -Wno-error=int-in-bool-context -Wno-error=memset-elt-size -Wno-error=noexcept-type -Wno-error=nonnull -Wno-error=pointer-compare -Wno-error=stringop-overflow -Wno-error=aggressive-loop-optimizations -Wno-error=cast-function-type -Wno-error=catch-value -Wno-error=multistatement-macros -Wno-error=restrict -Wno-error=sizeof-pointer-memaccess -Wno-error=stringop-truncation -Wno-return-type -Wno-address-of-packed-member -fno-strict-aliasing   -fno-exceptions -fno-rtti -fvisibility-inlines-hidden -g1 -std=c++17  -Wno-attributes -Wno-deprecated-declarations -Wno-error=class-memaccess -Wno-literal-suffix -Wno-c++20-extensions -Wno-attributes -Wno-error=unknown-pragmas -Wno-dangling-reference        -c /workspace/src/contrib/llvm-project/lldb/source/Commands/CommandObjectStats.cpp -o Commands/CommandObjectStats.pico
--- Commands/CommandObjectTarget.pico ---
/usr/local/bin/x86_64-unknown-freebsd15.1-g++14  --sysroot=/tmp/obj/workspace/src/amd64.amd64/tmp -B/usr/local/x86_64-unknown-freebsd15.1/bin/ -fpic -DPIC  -UPIC -O2 -pipe -fno-common -I/workspace/src/contrib/llvm-project/lldb/include -I/workspace/src/contrib/llvm-project/lldb/source -I/tmp/obj/workspace/src/amd64.amd64/lib/clang/libllvm -I/tmp/obj/workspace/src/amd64.amd64/lib/clang/libclang -I/tmp/obj/workspace/src/amd64.amd64/lib/clang/liblldb -I/workspace/src/contrib/lua/src -I/workspace/src/lib/liblua -I/workspace/src/contrib/llvm-project/clang/include -DCLANG_ENABLE_STATIC_ANALYZER -I/workspace/src/lib/clang/include -I/workspace/src/contrib/llvm-project/llvm/include -D__STDC_CONSTANT_MACROS -D__STDC_FORMAT_MACROS -D__STDC_LIMIT_MACROS -DHAVE_VCS_VERSION_INC -DLLVM_DEFAULT_TARGET_TRIPLE=\"x86_64-unknown-freebsd16.0\" -DLLVM_HOST_TRIPLE=\"x86_64-unknown-freebsd16.0\" -DDEFAULT_SYSROOT=\"\" -DLLVM_TARGET_ENABLE_AARCH64 -DLLVM_TARGET_ENABLE_ARM -DLLVM_TARGET_ENABLE_POWERPC -DLLVM_TARGET_ENABLE_RISCV -DLLVM_TARGET_ENABLE_X86 -DLLVM_NATIVE_ASMPARSER=LLVMInitializeX86AsmParser -DLLVM_NATIVE_ASMPRINTER=LLVMInitializeX86AsmPrinter -DLLVM_NATIVE_DISASSEMBLER=LLVMInitializeX86Disassembler -DLLVM_NATIVE_TARGET=LLVMInitializeX86Target -DLLVM_NATIVE_TARGETINFO=LLVMInitializeX86TargetInfo -DLLVM_NATIVE_TARGETMC=LLVMInitializeX86TargetMC -ffunction-sections -fdata-sections -g1 -MD -MF.depend.Commands_CommandObjectTarget.pico -MTCommands/CommandObjectTarget.pico -Wno-format-zero-length -fstack-protector-strong -Wdate-time -Wno-error=address -Wno-error=array-bounds -Wno-error=attributes -Wno-error=bool-compare -Wno-error=cast-align -Wno-error=clobbered -Wno-error=deprecated-declarations -Wno-error=enum-compare -Wno-error=extra -Wno-error=logical-not-parentheses -Wno-error=strict-aliasing -Wno-error=uninitialized -Wno-error=unused-function -Wno-error=unused-value -Wno-error=empty-body -Wno-error=maybe-uninitialized -Wno-error=nonnull-compare -Wno-error=shift-negative-value -Wno-error=tautological-compare -Wno-error=unused-const-variable -Wno-error=bool-operation -Wno-error=deprecated -Wno-error=expansion-to-defined -Wno-error=format-overflow -Wno-error=format-truncation -Wno-error=implicit-fallthrough -Wno-error=int-in-bool-context -Wno-error=memset-elt-size -Wno-error=noexcept-type -Wno-error=nonnull -Wno-error=pointer-compare -Wno-error=stringop-overflow -Wno-error=aggressive-loop-optimizations -Wno-error=cast-function-type -Wno-error=catch-value -Wno-error=multistatement-macros -Wno-error=restrict -Wno-error=sizeof-pointer-memaccess -Wno-error=stringop-truncation -Wno-return-type -Wno-address-of-packed-member -fno-strict-aliasing   -fno-exceptions -fno-rtti -fvisibility-inlines-hidden -g1 -std=c++17  -Wno-attributes -Wno-deprecated-declarations -Wno-error=class-memaccess -Wno-literal-suffix -Wno-c++20-extensions -Wno-attributes -Wno-error=unknown-pragmas -Wno-dangling-reference        -c /workspace/src/contrib/llvm-project/lldb/source/Commands/CommandObjectTarget.cpp -o Commands/CommandObjectTarget.pico
--- Commands/CommandObjectThread.pico ---
/usr/local/bin/x86_64-unknown-freebsd15.1-g++14  --sysroot=/tmp/obj/workspace/src/amd64.amd64/tmp -B/usr/local/x86_64-unknown-freebsd15.1/bin/ -fpic -DPIC  -UPIC -O2 -pipe -fno-common -I/workspace/src/contrib/llvm-project/lldb/include -I/workspace/src/contrib/llvm-project/lldb/source -I/tmp/obj/workspace/src/amd64.amd64/lib/clang/libllvm -I/tmp/obj/workspace/src/amd64.amd64/lib/clang/libclang -I/tmp/obj/workspace/src/amd64.amd64/lib/clang/liblldb -I/workspace/src/contrib/lua/src -I/workspace/src/lib/liblua -I/workspace/src/contrib/llvm-project/clang/include -DCLANG_ENABLE_STATIC_ANALYZER -I/workspace/src/lib/clang/include -I/workspace/src/contrib/llvm-project/llvm/include -D__STDC_CONSTANT_MACROS -D__STDC_FORMAT_MACROS -D__STDC_LIMIT_MACROS -DHAVE_VCS_VERSION_INC -DLLVM_DEFAULT_TARGET_TRIPLE=\"x86_64-unknown-freebsd16.0\" -DLLVM_HOST_TRIPLE=\"x86_64-unknown-freebsd16.0\" -DDEFAULT_SYSROOT=\"\" -DLLVM_TARGET_ENABLE_AARCH64 -DLLVM_TARGET_ENABLE_ARM -DLLVM_TARGET_ENABLE_POWERPC -DLLVM_TARGET_ENABLE_RISCV -DLLVM_TARGET_ENABLE_X86 -DLLVM_NATIVE_ASMPARSER=LLVMInitializeX86AsmParser -DLLVM_NATIVE_ASMPRINTER=LLVMInitializeX86AsmPrinter -DLLVM_NATIVE_DISASSEMBLER=LLVMInitializeX86Disassembler -DLLVM_NATIVE_TARGET=LLVMInitializeX86Target -DLLVM_NATIVE_TARGETINFO=LLVMInitializeX86TargetInfo -DLLVM_NATIVE_TARGETMC=LLVMInitializeX86TargetMC -ffunction-sections -fdata-sections -g1 -MD -MF.depend.Commands_CommandObjectThread.pico -MTCommands/CommandObjectThread.pico -Wno-format-zero-length -fstack-protector-strong -Wdate-time -Wno-error=address -Wno-error=array-bounds -Wno-error=attributes -Wno-error=bool-compare -Wno-error=cast-align -Wno-error=clobbered -Wno-error=deprecated-declarations -Wno-error=enum-compare -Wno-error=extra -Wno-error=logical-not-parentheses -Wno-error=strict-aliasing -Wno-error=uninitialized -Wno-error=unused-function -Wno-error=unused-value -Wno-error=empty-body -Wno-error=maybe-uninitialized -Wno-error=nonnull-compare -Wno-error=shift-negative-value -Wno-error=tautological-compare -Wno-error=unused-const-variable -Wno-error=bool-operation -Wno-error=deprecated -Wno-error=expansion-to-defined -Wno-error=format-overflow -Wno-error=format-truncation -Wno-error=implicit-fallthrough -Wno-error=int-in-bool-context -Wno-error=memset-elt-size -Wno-error=noexcept-type -Wno-error=nonnull -Wno-error=pointer-compare -Wno-error=stringop-overflow -Wno-error=aggressive-loop-optimizations -Wno-error=cast-function-type -Wno-error=catch-value -Wno-error=multistatement-macros -Wno-error=restrict -Wno-error=sizeof-pointer-memaccess -Wno-error=stringop-truncation -Wno-return-type -Wno-address-of-packed-member -fno-strict-aliasing   -fno-exceptions -fno-rtti -fvisibility-inlines-hidden -g1 -std=c++17  -Wno-attributes -Wno-deprecated-declarations -Wno-error=class-memaccess -Wno-literal-suffix -Wno-c++20-extensions -Wno-attributes -Wno-error=unknown-pragmas -Wno-dangling-reference        -c /workspace/src/contrib/llvm-project/lldb/source/Commands/CommandObjectThread.cpp -o Commands/CommandObjectThread.pico
--- Commands/CommandObjectThreadUtil.pico ---
/usr/local/bin/x86_64-unknown-freebsd15.1-g++14  --sysroot=/tmp/obj/workspace/src/amd64.amd64/tmp -B/usr/local/x86_64-unknown-freebsd15.1/bin/ -fpic -DPIC  -UPIC -O2 -pipe -fno-common -I/workspace/src/contrib/llvm-project/lldb/include -I/workspace/src/contrib/llvm-project/lldb/source -I/tmp/obj/workspace/src/amd64.amd64/lib/clang/libllvm -I/tmp/obj/workspace/src/amd64.amd64/lib/clang/libclang -I/tmp/obj/workspace/src/amd64.amd64/lib/clang/liblldb -I/workspace/src/contrib/lua/src -I/workspace/src/lib/liblua -I/workspace/src/contrib/llvm-project/clang/include -DCLANG_ENABLE_STATIC_ANALYZER -I/workspace/src/lib/clang/include -I/workspace/src/contrib/llvm-project/llvm/include -D__STDC_CONSTANT_MACROS -D__STDC_FORMAT_MACROS -D__STDC_LIMIT_MACROS -DHAVE_VCS_VERSION_INC -DLLVM_DEFAULT_TARGET_TRIPLE=\"x86_64-unknown-freebsd16.0\" -DLLVM_HOST_TRIPLE=\"x86_64-unknown-freebsd16.0\" -DDEFAULT_SYSROOT=\"\" -DLLVM_TARGET_ENABLE_AARCH64 -DLLVM_TARGET_ENABLE_ARM -DLLVM_TARGET_ENABLE_POWERPC -DLLVM_TARGET_ENABLE_RISCV -DLLVM_TARGET_ENABLE_X86 -DLLVM_NATIVE_ASMPARSER=LLVMInitializeX86AsmParser -DLLVM_NATIVE_ASMPRINTER=LLVMInitializeX86AsmPrinter -DLLVM_NATIVE_DISASSEMBLER=LLVMInitializeX86Disassembler -DLLVM_NATIVE_TARGET=LLVMInitializeX86Target -DLLVM_NATIVE_TARGETINFO=LLVMInitializeX86TargetInfo -DLLVM_NATIVE_TARGETMC=LLVMInitializeX86TargetMC -ffunction-sections -fdata-sections -g1 -MD -MF.depend.Commands_CommandObjectThreadUtil.pico -MTCommands/CommandObjectThreadUtil.pico -Wno-format-zero-length -fstack-protector-strong -Wdate-time -Wno-error=address -Wno-error=array-bounds -Wno-error=attributes -Wno-error=bool-compare -Wno-error=cast-align -Wno-error=clobbered -Wno-error=deprecated-declarations -Wno-error=enum-compare -Wno-error=extra -Wno-error=logical-not-parentheses -Wno-error=strict-aliasing -Wno-error=uninitialized -Wno-error=unused-function -Wno-error=unused-value -Wno-error=empty-body -Wno-error=maybe-uninitialized -Wno-error=nonnull-compare -Wno-error=shift-negative-value -Wno-error=tautological-compare -Wno-error=unused-const-variable -Wno-error=bool-operation -Wno-error=deprecated -Wno-error=expansion-to-defined -Wno-error=format-overflow -Wno-error=format-truncation -Wno-error=implicit-fallthrough -Wno-error=int-in-bool-context -Wno-error=memset-elt-size -Wno-error=noexcept-type -Wno-error=nonnull -Wno-error=pointer-compare -Wno-error=stringop-overflow -Wno-error=aggressive-loop-optimizations -Wno-error=cast-function-type -Wno-error=catch-value -Wno-error=multistatement-macros -Wno-error=restrict -Wno-error=sizeof-pointer-memaccess -Wno-error=stringop-truncation -Wno-return-type -Wno-address-of-packed-member -fno-strict-aliasing   -fno-exceptions -fno-rtti -fvisibility-inlines-hidden -g1 -std=c++17  -Wno-attributes -Wno-deprecated-declarations -Wno-error=class-memaccess -Wno-literal-suffix -Wno-c++20-extensions -Wno-attributes -Wno-error=unknown-pragmas -Wno-dangling-reference        -c /workspace/src/contrib/llvm-project/lldb/source/Commands/CommandObjectThreadUtil.cpp -o Commands/CommandObjectThreadUtil.pico
--- Commands/CommandObjectTrace.pico ---
/usr/local/bin/x86_64-unknown-freebsd15.1-g++14  --sysroot=/tmp/obj/workspace/src/amd64.amd64/tmp -B/usr/local/x86_64-unknown-freebsd15.1/bin/ -fpic -DPIC  -UPIC -O2 -pipe -fno-common -I/workspace/src/contrib/llvm-project/lldb/include -I/workspace/src/contrib/llvm-project/lldb/source -I/tmp/obj/workspace/src/amd64.amd64/lib/clang/libllvm -I/tmp/obj/workspace/src/amd64.amd64/lib/clang/libclang -I/tmp/obj/workspace/src/amd64.amd64/lib/clang/liblldb -I/workspace/src/contrib/lua/src -I/workspace/src/lib/liblua -I/workspace/src/contrib/llvm-project/clang/include -DCLANG_ENABLE_STATIC_ANALYZER -I/workspace/src/lib/clang/include -I/workspace/src/contrib/llvm-project/llvm/include -D__STDC_CONSTANT_MACROS -D__STDC_FORMAT_MACROS -D__STDC_LIMIT_MACROS -DHAVE_VCS_VERSION_INC -DLLVM_DEFAULT_TARGET_TRIPLE=\"x86_64-unknown-freebsd16.0\" -DLLVM_HOST_TRIPLE=\"x86_64-unknown-freebsd16.0\" -DDEFAULT_SYSROOT=\"\" -DLLVM_TARGET_ENABLE_AARCH64 -DLLVM_TARGET_ENABLE_ARM -DLLVM_TARGET_ENABLE_POWERPC -DLLVM_TARGET_ENABLE_RISCV -DLLVM_TARGET_ENABLE_X86 -DLLVM_NATIVE_ASMPARSER=LLVMInitializeX86AsmParser -DLLVM_NATIVE_ASMPRINTER=LLVMInitializeX86AsmPrinter -DLLVM_NATIVE_DISASSEMBLER=LLVMInitializeX86Disassembler -DLLVM_NATIVE_TARGET=LLVMInitializeX86Target -DLLVM_NATIVE_TARGETINFO=LLVMInitializeX86TargetInfo -DLLVM_NATIVE_TARGETMC=LLVMInitializeX86TargetMC -ffunction-sections -fdata-sections -g1 -MD -MF.depend.Commands_CommandObjectTrace.pico -MTCommands/CommandObjectTrace.pico -Wno-format-zero-length -fstack-protector-strong -Wdate-time -Wno-error=address -Wno-error=array-bounds -Wno-error=attributes -Wno-error=bool-compare -Wno-error=cast-align -Wno-error=clobbered -Wno-error=deprecated-declarations -Wno-error=enum-compare -Wno-error=extra -Wno-error=logical-not-parentheses -Wno-error=strict-aliasing -Wno-error=uninitialized -Wno-error=unused-function -Wno-error=unused-value -Wno-error=empty-body -Wno-error=maybe-uninitialized -Wno-error=nonnull-compare -Wno-error=shift-negative-value -Wno-error=tautological-compare -Wno-error=unused-const-variable -Wno-error=bool-operation -Wno-error=deprecated -Wno-error=expansion-to-defined -Wno-error=format-overflow -Wno-error=format-truncation -Wno-error=implicit-fallthrough -Wno-error=int-in-bool-context -Wno-error=memset-elt-size -Wno-error=noexcept-type -Wno-error=nonnull -Wno-error=pointer-compare -Wno-error=stringop-overflow -Wno-error=aggressive-loop-optimizations -Wno-error=cast-function-type -Wno-error=catch-value -Wno-error=multistatement-macros -Wno-error=restrict -Wno-error=sizeof-pointer-memaccess -Wno-error=stringop-truncation -Wno-return-type -Wno-address-of-packed-member -fno-strict-aliasing   -fno-exceptions -fno-rtti -fvisibility-inlines-hidden -g1 -std=c++17  -Wno-attributes -Wno-deprecated-declarations -Wno-error=class-memaccess -Wno-literal-suffix -Wno-c++20-extensions -Wno-attributes -Wno-error=unknown-pragmas -Wno-dangling-reference        -c /workspace/src/contrib/llvm-project/lldb/source/Commands/CommandObjectTrace.cpp -o Commands/CommandObjectTrace.pico
--- Commands/CommandObjectType.pico ---
/usr/local/bin/x86_64-unknown-freebsd15.1-g++14  --sysroot=/tmp/obj/workspace/src/amd64.amd64/tmp -B/usr/local/x86_64-unknown-freebsd15.1/bin/ -fpic -DPIC  -UPIC -O2 -pipe -fno-common -I/workspace/src/contrib/llvm-project/lldb/include -I/workspace/src/contrib/llvm-project/lldb/source -I/tmp/obj/workspace/src/amd64.amd64/lib/clang/libllvm -I/tmp/obj/workspace/src/amd64.amd64/lib/clang/libclang -I/tmp/obj/workspace/src/amd64.amd64/lib/clang/liblldb -I/workspace/src/contrib/lua/src -I/workspace/src/lib/liblua -I/workspace/src/contrib/llvm-project/clang/include -DCLANG_ENABLE_STATIC_ANALYZER -I/workspace/src/lib/clang/include -I/workspace/src/contrib/llvm-project/llvm/include -D__STDC_CONSTANT_MACROS -D__STDC_FORMAT_MACROS -D__STDC_LIMIT_MACROS -DHAVE_VCS_VERSION_INC -DLLVM_DEFAULT_TARGET_TRIPLE=\"x86_64-unknown-freebsd16.0\" -DLLVM_HOST_TRIPLE=\"x86_64-unknown-freebsd16.0\" -DDEFAULT_SYSROOT=\"\" -DLLVM_TARGET_ENABLE_AARCH64 -DLLVM_TARGET_ENABLE_ARM -DLLVM_TARGET_ENABLE_POWERPC -DLLVM_TARGET_ENABLE_RISCV -DLLVM_TARGET_ENABLE_X86 -DLLVM_NATIVE_ASMPARSER=LLVMInitializeX86AsmParser -DLLVM_NATIVE_ASMPRINTER=LLVMInitializeX86AsmPrinter -DLLVM_NATIVE_DISASSEMBLER=LLVMInitializeX86Disassembler -DLLVM_NATIVE_TARGET=LLVMInitializeX86Target -DLLVM_NATIVE_TARGETINFO=LLVMInitializeX86TargetInfo -DLLVM_NATIVE_TARGETMC=LLVMInitializeX86TargetMC -ffunction-sections -fdata-sections -g1 -MD -MF.depend.Commands_CommandObjectType.pico -MTCommands/CommandObjectType.pico -Wno-format-zero-length -fstack-protector-strong -Wdate-time -Wno-error=address -Wno-error=array-bounds -Wno-error=attributes -Wno-error=bool-compare -Wno-error=cast-align -Wno-error=clobbered -Wno-error=deprecated-declarations -Wno-error=enum-compare -Wno-error=extra -Wno-error=logical-not-parentheses -Wno-error=strict-aliasing -Wno-error=uninitialized -Wno-error=unused-function -Wno-error=unused-value -Wno-error=empty-body -Wno-error=maybe-uninitialized -Wno-error=nonnull-compare -Wno-error=shift-negative-value -Wno-error=tautological-compare -Wno-error=unused-const-variable -Wno-error=bool-operation -Wno-error=deprecated -Wno-error=expansion-to-defined -Wno-error=format-overflow -Wno-error=format-truncation -Wno-error=implicit-fallthrough -Wno-error=int-in-bool-context -Wno-error=memset-elt-size -Wno-error=noexcept-type -Wno-error=nonnull -Wno-error=pointer-compare -Wno-error=stringop-overflow -Wno-error=aggressive-loop-optimizations -Wno-error=cast-function-type -Wno-error=catch-value -Wno-error=multistatement-macros -Wno-error=restrict -Wno-error=sizeof-pointer-memaccess -Wno-error=stringop-truncation -Wno-return-type -Wno-address-of-packed-member -fno-strict-aliasing   -fno-exceptions -fno-rtti -fvisibility-inlines-hidden -g1 -std=c++17  -Wno-attributes -Wno-deprecated-declarations -Wno-error=class-memaccess -Wno-literal-suffix -Wno-c++20-extensions -Wno-attributes -Wno-error=unknown-pragmas -Wno-dangling-reference        -c /workspace/src/contrib/llvm-project/lldb/source/Commands/CommandObjectType.cpp -o Commands/CommandObjectType.pico
--- Commands/CommandObjectVersion.pico ---
/usr/local/bin/x86_64-unknown-freebsd15.1-g++14  --sysroot=/tmp/obj/workspace/src/amd64.amd64/tmp -B/usr/local/x86_64-unknown-freebsd15.1/bin/ -fpic -DPIC  -UPIC -O2 -pipe -fno-common -I/workspace/src/contrib/llvm-project/lldb/include -I/workspace/src/contrib/llvm-project/lldb/source -I/tmp/obj/workspace/src/amd64.amd64/lib/clang/libllvm -I/tmp/obj/workspace/src/amd64.amd64/lib/clang/libclang -I/tmp/obj/workspace/src/amd64.amd64/lib/clang/liblldb -I/workspace/src/contrib/lua/src -I/workspace/src/lib/liblua -I/workspace/src/contrib/llvm-project/clang/include -DCLANG_ENABLE_STATIC_ANALYZER -I/workspace/src/lib/clang/include -I/workspace/src/contrib/llvm-project/llvm/include -D__STDC_CONSTANT_MACROS -D__STDC_FORMAT_MACROS -D__STDC_LIMIT_MACROS -DHAVE_VCS_VERSION_INC -DLLVM_DEFAULT_TARGET_TRIPLE=\"x86_64-unknown-freebsd16.0\" -DLLVM_HOST_TRIPLE=\"x86_64-unknown-freebsd16.0\" -DDEFAULT_SYSROOT=\"\" -DLLVM_TARGET_ENABLE_AARCH64 -DLLVM_TARGET_ENABLE_ARM -DLLVM_TARGET_ENABLE_POWERPC -DLLVM_TARGET_ENABLE_RISCV -DLLVM_TARGET_ENABLE_X86 -DLLVM_NATIVE_ASMPARSER=LLVMInitializeX86AsmParser -DLLVM_NATIVE_ASMPRINTER=LLVMInitializeX86AsmPrinter -DLLVM_NATIVE_DISASSEMBLER=LLVMInitializeX86Disassembler -DLLVM_NATIVE_TARGET=LLVMInitializeX86Target -DLLVM_NATIVE_TARGETINFO=LLVMInitializeX86TargetInfo -DLLVM_NATIVE_TARGETMC=LLVMInitializeX86TargetMC -ffunction-sections -fdata-sections -g1 -MD -MF.depend.Commands_CommandObjectVersion.pico -MTCommands/CommandObjectVersion.pico -Wno-format-zero-length -fstack-protector-strong -Wdate-time -Wno-error=address -Wno-error=array-bounds -Wno-error=attributes -Wno-error=bool-compare -Wno-error=cast-align -Wno-error=clobbered -Wno-error=deprecated-declarations -Wno-error=enum-compare -Wno-error=extra -Wno-error=logical-not-parentheses -Wno-error=strict-aliasing -Wno-error=uninitialized -Wno-error=unused-function -Wno-error=unused-value -Wno-error=empty-body -Wno-error=maybe-uninitialized -Wno-error=nonnull-compare -Wno-error=shift-negative-value -Wno-error=tautological-compare -Wno-error=unused-const-variable -Wno-error=bool-operation -Wno-error=deprecated -Wno-error=expansion-to-defined -Wno-error=format-overflow -Wno-error=format-truncation -Wno-error=implicit-fallthrough -Wno-error=int-in-bool-context -Wno-error=memset-elt-size -Wno-error=noexcept-type -Wno-error=nonnull -Wno-error=pointer-compare -Wno-error=stringop-overflow -Wno-error=aggressive-loop-optimizations -Wno-error=cast-function-type -Wno-error=catch-value -Wno-error=multistatement-macros -Wno-error=restrict -Wno-error=sizeof-pointer-memaccess -Wno-error=stringop-truncation -Wno-return-type -Wno-address-of-packed-member -fno-strict-aliasing   -fno-exceptions -fno-rtti -fvisibility-inlines-hidden -g1 -std=c++17  -Wno-attributes -Wno-deprecated-declarations -Wno-error=class-memaccess -Wno-literal-suffix -Wno-c++20-extensions -Wno-attributes -Wno-error=unknown-pragmas -Wno-dangling-reference        -c /workspace/src/contrib/llvm-project/lldb/source/Commands/CommandObjectVersion.cpp -o Commands/CommandObjectVersion.pico
--- Commands/CommandObjectWatchpoint.pico ---
/usr/local/bin/x86_64-unknown-freebsd15.1-g++14  --sysroot=/tmp/obj/workspace/src/amd64.amd64/tmp -B/usr/local/x86_64-unknown-freebsd15.1/bin/ -fpic -DPIC  -UPIC -O2 -pipe -fno-common -I/workspace/src/contrib/llvm-project/lldb/include -I/workspace/src/contrib/llvm-project/lldb/source -I/tmp/obj/workspace/src/amd64.amd64/lib/clang/libllvm -I/tmp/obj/workspace/src/amd64.amd64/lib/clang/libclang -I/tmp/obj/workspace/src/amd64.amd64/lib/clang/liblldb -I/workspace/src/contrib/lua/src -I/workspace/src/lib/liblua -I/workspace/src/contrib/llvm-project/clang/include -DCLANG_ENABLE_STATIC_ANALYZER -I/workspace/src/lib/clang/include -I/workspace/src/contrib/llvm-project/llvm/include -D__STDC_CONSTANT_MACROS -D__STDC_FORMAT_MACROS -D__STDC_LIMIT_MACROS -DHAVE_VCS_VERSION_INC -DLLVM_DEFAULT_TARGET_TRIPLE=\"x86_64-unknown-freebsd16.0\" -DLLVM_HOST_TRIPLE=\"x86_64-unknown-freebsd16.0\" -DDEFAULT_SYSROOT=\"\" -DLLVM_TARGET_ENABLE_AARCH64 -DLLVM_TARGET_ENABLE_ARM -DLLVM_TARGET_ENABLE_POWERPC -DLLVM_TARGET_ENABLE_RISCV -DLLVM_TARGET_ENABLE_X86 -DLLVM_NATIVE_ASMPARSER=LLVMInitializeX86AsmParser -DLLVM_NATIVE_ASMPRINTER=LLVMInitializeX86AsmPrinter -DLLVM_NATIVE_DISASSEMBLER=LLVMInitializeX86Disassembler -DLLVM_NATIVE_TARGET=LLVMInitializeX86Target -DLLVM_NATIVE_TARGETINFO=LLVMInitializeX86TargetInfo -DLLVM_NATIVE_TARGETMC=LLVMInitializeX86TargetMC -ffunction-sections -fdata-sections -g1 -MD -MF.depend.Commands_CommandObjectWatchpoint.pico -MTCommands/CommandObjectWatchpoint.pico -Wno-format-zero-length -fstack-protector-strong -Wdate-time -Wno-error=address -Wno-error=array-bounds -Wno-error=attributes -Wno-error=bool-compare -Wno-error=cast-align -Wno-error=clobbered -Wno-error=deprecated-declarations -Wno-error=enum-compare -Wno-error=extra -Wno-error=logical-not-parentheses -Wno-error=strict-aliasing -Wno-error=uninitialized -Wno-error=unused-function -Wno-error=unused-value -Wno-error=empty-body -Wno-error=maybe-uninitialized -Wno-error=nonnull-compare -Wno-error=shift-negative-value -Wno-error=tautological-compare -Wno-error=unused-const-variable -Wno-error=bool-operation -Wno-error=deprecated -Wno-error=expansion-to-defined -Wno-error=format-overflow -Wno-error=format-truncation -Wno-error=implicit-fallthrough -Wno-error=int-in-bool-context -Wno-error=memset-elt-size -Wno-error=noexcept-type -Wno-error=nonnull -Wno-error=pointer-compare -Wno-error=stringop-overflow -Wno-error=aggressive-loop-optimizations -Wno-error=cast-function-type -Wno-error=catch-value -Wno-error=multistatement-macros -Wno-error=restrict -Wno-error=sizeof-pointer-memaccess -Wno-error=stringop-truncation -Wno-return-type -Wno-address-of-packed-member -fno-strict-aliasing   -fno-exceptions -fno-rtti -fvisibility-inlines-hidden -g1 -std=c++17  -Wno-attributes -Wno-deprecated-declarations -Wno-error=class-memaccess -Wno-literal-suffix -Wno-c++20-extensions -Wno-attributes -Wno-error=unknown-pragmas -Wno-dangling-reference        -c /workspace/src/contrib/llvm-project/lldb/source/Commands/CommandObjectWatchpoint.cpp -o Commands/CommandObjectWatchpoint.pico
--- Commands/CommandObjectWatchpointCommand.pico ---
/usr/local/bin/x86_64-unknown-freebsd15.1-g++14  --sysroot=/tmp/obj/workspace/src/amd64.amd64/tmp -B/usr/local/x86_64-unknown-freebsd15.1/bin/ -fpic -DPIC  -UPIC -O2 -pipe -fno-common -I/workspace/src/contrib/llvm-project/lldb/include -I/workspace/src/contrib/llvm-project/lldb/source -I/tmp/obj/workspace/src/amd64.amd64/lib/clang/libllvm -I/tmp/obj/workspace/src/amd64.amd64/lib/clang/libclang -I/tmp/obj/workspace/src/amd64.amd64/lib/clang/liblldb -I/workspace/src/contrib/lua/src -I/workspace/src/lib/liblua -I/workspace/src/contrib/llvm-project/clang/include -DCLANG_ENABLE_STATIC_ANALYZER -I/workspace/src/lib/clang/include -I/workspace/src/contrib/llvm-project/llvm/include -D__STDC_CONSTANT_MACROS -D__STDC_FORMAT_MACROS -D__STDC_LIMIT_MACROS -DHAVE_VCS_VERSION_INC -DLLVM_DEFAULT_TARGET_TRIPLE=\"x86_64-unknown-freebsd16.0\" -DLLVM_HOST_TRIPLE=\"x86_64-unknown-freebsd16.0\" -DDEFAULT_SYSROOT=\"\" -DLLVM_TARGET_ENABLE_AARCH64 -DLLVM_TARGET_ENABLE_ARM -DLLVM_TARGET_ENABLE_POWERPC -DLLVM_TARGET_ENABLE_RISCV -DLLVM_TARGET_ENABLE_X86 -DLLVM_NATIVE_ASMPARSER=LLVMInitializeX86AsmParser -DLLVM_NATIVE_ASMPRINTER=LLVMInitializeX86AsmPrinter -DLLVM_NATIVE_DISASSEMBLER=LLVMInitializeX86Disassembler -DLLVM_NATIVE_TARGET=LLVMInitializeX86Target -DLLVM_NATIVE_TARGETINFO=LLVMInitializeX86TargetInfo -DLLVM_NATIVE_TARGETMC=LLVMInitializeX86TargetMC -ffunction-sections -fdata-sections -g1 -MD -MF.depend.Commands_CommandObjectWatchpointCommand.pico -MTCommands/CommandObjectWatchpointCommand.pico -Wno-format-zero-length -fstack-protector-strong -Wdate-time -Wno-error=address -Wno-error=array-bounds -Wno-error=attributes -Wno-error=bool-compare -Wno-error=cast-align -Wno-error=clobbered -Wno-error=deprecated-declarations -Wno-error=enum-compare -Wno-error=extra -Wno-error=logical-not-parentheses -Wno-error=strict-aliasing -Wno-error=uninitialized -Wno-error=unused-function -Wno-error=unused-value -Wno-error=empty-body -Wno-error=maybe-uninitialized -Wno-error=nonnull-compare -Wno-error=shift-negative-value -Wno-error=tautological-compare -Wno-error=unused-const-variable -Wno-error=bool-operation -Wno-error=deprecated -Wno-error=expansion-to-defined -Wno-error=format-overflow -Wno-error=format-truncation -Wno-error=implicit-fallthrough -Wno-error=int-in-bool-context -Wno-error=memset-elt-size -Wno-error=noexcept-type -Wno-error=nonnull -Wno-error=pointer-compare -Wno-error=stringop-overflow -Wno-error=aggressive-loop-optimizations -Wno-error=cast-function-type -Wno-error=catch-value -Wno-error=multistatement-macros -Wno-error=restrict -Wno-error=sizeof-pointer-memaccess -Wno-error=stringop-truncation -Wno-return-type -Wno-address-of-packed-member -fno-strict-aliasing   -fno-exceptions -fno-rtti -fvisibility-inlines-hidden -g1 -std=c++17  -Wno-attributes -Wno-deprecated-declarations -Wno-error=class-memaccess -Wno-literal-suffix -Wno-c++20-extensions -Wno-attributes -Wno-error=unknown-pragmas -Wno-dangling-reference        -c /workspace/src/contrib/llvm-project/lldb/source/Commands/CommandObjectWatchpointCommand.cpp -o Commands/CommandObjectWatchpointCommand.pico
--- Commands/CommandOptionArgumentTable.pico ---
/usr/local/bin/x86_64-unknown-freebsd15.1-g++14  --sysroot=/tmp/obj/workspace/src/amd64.amd64/tmp -B/usr/local/x86_64-unknown-freebsd15.1/bin/ -fpic -DPIC  -UPIC -O2 -pipe -fno-common -I/workspace/src/contrib/llvm-project/lldb/include -I/workspace/src/contrib/llvm-project/lldb/source -I/tmp/obj/workspace/src/amd64.amd64/lib/clang/libllvm -I/tmp/obj/workspace/src/amd64.amd64/lib/clang/libclang -I/tmp/obj/workspace/src/amd64.amd64/lib/clang/liblldb -I/workspace/src/contrib/lua/src -I/workspace/src/lib/liblua -I/workspace/src/contrib/llvm-project/clang/include -DCLANG_ENABLE_STATIC_ANALYZER -I/workspace/src/lib/clang/include -I/workspace/src/contrib/llvm-project/llvm/include -D__STDC_CONSTANT_MACROS -D__STDC_FORMAT_MACROS -D__STDC_LIMIT_MACROS -DHAVE_VCS_VERSION_INC -DLLVM_DEFAULT_TARGET_TRIPLE=\"x86_64-unknown-freebsd16.0\" -DLLVM_HOST_TRIPLE=\"x86_64-unknown-freebsd16.0\" -DDEFAULT_SYSROOT=\"\" -DLLVM_TARGET_ENABLE_AARCH64 -DLLVM_TARGET_ENABLE_ARM -DLLVM_TARGET_ENABLE_POWERPC -DLLVM_TARGET_ENABLE_RISCV -DLLVM_TARGET_ENABLE_X86 -DLLVM_NATIVE_ASMPARSER=LLVMInitializeX86AsmParser -DLLVM_NATIVE_ASMPRINTER=LLVMInitializeX86AsmPrinter -DLLVM_NATIVE_DISASSEMBLER=LLVMInitializeX86Disassembler -DLLVM_NATIVE_TARGET=LLVMInitializeX86Target -DLLVM_NATIVE_TARGETINFO=LLVMInitializeX86TargetInfo -DLLVM_NATIVE_TARGETMC=LLVMInitializeX86TargetMC -ffunction-sections -fdata-sections -g1 -MD -MF.depend.Commands_CommandOptionArgumentTable.pico -MTCommands/CommandOptionArgumentTable.pico -Wno-format-zero-length -fstack-protector-strong -Wdate-time -Wno-error=address -Wno-error=array-bounds -Wno-error=attributes -Wno-error=bool-compare -Wno-error=cast-align -Wno-error=clobbered -Wno-error=deprecated-declarations -Wno-error=enum-compare -Wno-error=extra -Wno-error=logical-not-parentheses -Wno-error=strict-aliasing -Wno-error=uninitialized -Wno-error=unused-function -Wno-error=unused-value -Wno-error=empty-body -Wno-error=maybe-uninitialized -Wno-error=nonnull-compare -Wno-error=shift-negative-value -Wno-error=tautological-compare -Wno-error=unused-const-variable -Wno-error=bool-operation -Wno-error=deprecated -Wno-error=expansion-to-defined -Wno-error=format-overflow -Wno-error=format-truncation -Wno-error=implicit-fallthrough -Wno-error=int-in-bool-context -Wno-error=memset-elt-size -Wno-error=noexcept-type -Wno-error=nonnull -Wno-error=pointer-compare -Wno-error=stringop-overflow -Wno-error=aggressive-loop-optimizations -Wno-error=cast-function-type -Wno-error=catch-value -Wno-error=multistatement-macros -Wno-error=restrict -Wno-error=sizeof-pointer-memaccess -Wno-error=stringop-truncation -Wno-return-type -Wno-address-of-packed-member -fno-strict-aliasing   -fno-exceptions -fno-rtti -fvisibility-inlines-hidden -g1 -std=c++17  -Wno-attributes -Wno-deprecated-declarations -Wno-error=class-memaccess -Wno-literal-suffix -Wno-c++20-extensions -Wno-attributes -Wno-error=unknown-pragmas -Wno-dangling-reference        -c /workspace/src/contrib/llvm-project/lldb/source/Commands/CommandOptionArgumentTable.cpp -o Commands/CommandOptionArgumentTable.pico
--- Commands/CommandOptionsProcessAttach.pico ---
/usr/local/bin/x86_64-unknown-freebsd15.1-g++14  --sysroot=/tmp/obj/workspace/src/amd64.amd64/tmp -B/usr/local/x86_64-unknown-freebsd15.1/bin/ -fpic -DPIC  -UPIC -O2 -pipe -fno-common -I/workspace/src/contrib/llvm-project/lldb/include -I/workspace/src/contrib/llvm-project/lldb/source -I/tmp/obj/workspace/src/amd64.amd64/lib/clang/libllvm -I/tmp/obj/workspace/src/amd64.amd64/lib/clang/libclang -I/tmp/obj/workspace/src/amd64.amd64/lib/clang/liblldb -I/workspace/src/contrib/lua/src -I/workspace/src/lib/liblua -I/workspace/src/contrib/llvm-project/clang/include -DCLANG_ENABLE_STATIC_ANALYZER -I/workspace/src/lib/clang/include -I/workspace/src/contrib/llvm-project/llvm/include -D__STDC_CONSTANT_MACROS -D__STDC_FORMAT_MACROS -D__STDC_LIMIT_MACROS -DHAVE_VCS_VERSION_INC -DLLVM_DEFAULT_TARGET_TRIPLE=\"x86_64-unknown-freebsd16.0\" -DLLVM_HOST_TRIPLE=\"x86_64-unknown-freebsd16.0\" -DDEFAULT_SYSROOT=\"\" -DLLVM_TARGET_ENABLE_AARCH64 -DLLVM_TARGET_ENABLE_ARM -DLLVM_TARGET_ENABLE_POWERPC -DLLVM_TARGET_ENABLE_RISCV -DLLVM_TARGET_ENABLE_X86 -DLLVM_NATIVE_ASMPARSER=LLVMInitializeX86AsmParser -DLLVM_NATIVE_ASMPRINTER=LLVMInitializeX86AsmPrinter -DLLVM_NATIVE_DISASSEMBLER=LLVMInitializeX86Disassembler -DLLVM_NATIVE_TARGET=LLVMInitializeX86Target -DLLVM_NATIVE_TARGETINFO=LLVMInitializeX86TargetInfo -DLLVM_NATIVE_TARGETMC=LLVMInitializeX86TargetMC -ffunction-sections -fdata-sections -g1 -MD -MF.depend.Commands_CommandOptionsProcessAttach.pico -MTCommands/CommandOptionsProcessAttach.pico -Wno-format-zero-length -fstack-protector-strong -Wdate-time -Wno-error=address -Wno-error=array-bounds -Wno-error=attributes -Wno-error=bool-compare -Wno-error=cast-align -Wno-error=clobbered -Wno-error=deprecated-declarations -Wno-error=enum-compare -Wno-error=extra -Wno-error=logical-not-parentheses -Wno-error=strict-aliasing -Wno-error=uninitialized -Wno-error=unused-function -Wno-error=unused-value -Wno-error=empty-body -Wno-error=maybe-uninitialized -Wno-error=nonnull-compare -Wno-error=shift-negative-value -Wno-error=tautological-compare -Wno-error=unused-const-variable -Wno-error=bool-operation -Wno-error=deprecated -Wno-error=expansion-to-defined -Wno-error=format-overflow -Wno-error=format-truncation -Wno-error=implicit-fallthrough -Wno-error=int-in-bool-context -Wno-error=memset-elt-size -Wno-error=noexcept-type -Wno-error=nonnull -Wno-error=pointer-compare -Wno-error=stringop-overflow -Wno-error=aggressive-loop-optimizations -Wno-error=cast-function-type -Wno-error=catch-value -Wno-error=multistatement-macros -Wno-error=restrict -Wno-error=sizeof-pointer-memaccess -Wno-error=stringop-truncation -Wno-return-type -Wno-address-of-packed-member -fno-strict-aliasing   -fno-exceptions -fno-rtti -fvisibility-inlines-hidden -g1 -std=c++17  -Wno-attributes -Wno-deprecated-declarations -Wno-error=class-memaccess -Wno-literal-suffix -Wno-c++20-extensions -Wno-attributes -Wno-error=unknown-pragmas -Wno-dangling-reference        -c /workspace/src/contrib/llvm-project/lldb/source/Commands/CommandOptionsProcessAttach.cpp -o Commands/CommandOptionsProcessAttach.pico
--- Commands/CommandOptionsProcessLaunch.pico ---
/usr/local/bin/x86_64-unknown-freebsd15.1-g++14  --sysroot=/tmp/obj/workspace/src/amd64.amd64/tmp -B/usr/local/x86_64-unknown-freebsd15.1/bin/ -fpic -DPIC  -UPIC -O2 -pipe -fno-common -I/workspace/src/contrib/llvm-project/lldb/include -I/workspace/src/contrib/llvm-project/lldb/source -I/tmp/obj/workspace/src/amd64.amd64/lib/clang/libllvm -I/tmp/obj/workspace/src/amd64.amd64/lib/clang/libclang -I/tmp/obj/workspace/src/amd64.amd64/lib/clang/liblldb -I/workspace/src/contrib/lua/src -I/workspace/src/lib/liblua -I/workspace/src/contrib/llvm-project/clang/include -DCLANG_ENABLE_STATIC_ANALYZER -I/workspace/src/lib/clang/include -I/workspace/src/contrib/llvm-project/llvm/include -D__STDC_CONSTANT_MACROS -D__STDC_FORMAT_MACROS -D__STDC_LIMIT_MACROS -DHAVE_VCS_VERSION_INC -DLLVM_DEFAULT_TARGET_TRIPLE=\"x86_64-unknown-freebsd16.0\" -DLLVM_HOST_TRIPLE=\"x86_64-unknown-freebsd16.0\" -DDEFAULT_SYSROOT=\"\" -DLLVM_TARGET_ENABLE_AARCH64 -DLLVM_TARGET_ENABLE_ARM -DLLVM_TARGET_ENABLE_POWERPC -DLLVM_TARGET_ENABLE_RISCV -DLLVM_TARGET_ENABLE_X86 -DLLVM_NATIVE_ASMPARSER=LLVMInitializeX86AsmParser -DLLVM_NATIVE_ASMPRINTER=LLVMInitializeX86AsmPrinter -DLLVM_NATIVE_DISASSEMBLER=LLVMInitializeX86Disassembler -DLLVM_NATIVE_TARGET=LLVMInitializeX86Target -DLLVM_NATIVE_TARGETINFO=LLVMInitializeX86TargetInfo -DLLVM_NATIVE_TARGETMC=LLVMInitializeX86TargetMC -ffunction-sections -fdata-sections -g1 -MD -MF.depend.Commands_CommandOptionsProcessLaunch.pico -MTCommands/CommandOptionsProcessLaunch.pico -Wno-format-zero-length -fstack-protector-strong -Wdate-time -Wno-error=address -Wno-error=array-bounds -Wno-error=attributes -Wno-error=bool-compare -Wno-error=cast-align -Wno-error=clobbered -Wno-error=deprecated-declarations -Wno-error=enum-compare -Wno-error=extra -Wno-error=logical-not-parentheses -Wno-error=strict-aliasing -Wno-error=uninitialized -Wno-error=unused-function -Wno-error=unused-value -Wno-error=empty-body -Wno-error=maybe-uninitialized -Wno-error=nonnull-compare -Wno-error=shift-negative-value -Wno-error=tautological-compare -Wno-error=unused-const-variable -Wno-error=bool-operation -Wno-error=deprecated -Wno-error=expansion-to-defined -Wno-error=format-overflow -Wno-error=format-truncation -Wno-error=implicit-fallthrough -Wno-error=int-in-bool-context -Wno-error=memset-elt-size -Wno-error=noexcept-type -Wno-error=nonnull -Wno-error=pointer-compare -Wno-error=stringop-overflow -Wno-error=aggressive-loop-optimizations -Wno-error=cast-function-type -Wno-error=catch-value -Wno-error=multistatement-macros -Wno-error=restrict -Wno-error=sizeof-pointer-memaccess -Wno-error=stringop-truncation -Wno-return-type -Wno-address-of-packed-member -fno-strict-aliasing   -fno-exceptions -fno-rtti -fvisibility-inlines-hidden -g1 -std=c++17  -Wno-attributes -Wno-deprecated-declarations -Wno-error=class-memaccess -Wno-literal-suffix -Wno-c++20-extensions -Wno-attributes -Wno-error=unknown-pragmas -Wno-dangling-reference        -c /workspace/src/contrib/llvm-project/lldb/source/Commands/CommandOptionsProcessLaunch.cpp -o Commands/CommandOptionsProcessLaunch.pico
--- Core/Address.pico ---
/usr/local/bin/x86_64-unknown-freebsd15.1-g++14  --sysroot=/tmp/obj/workspace/src/amd64.amd64/tmp -B/usr/local/x86_64-unknown-freebsd15.1/bin/ -fpic -DPIC  -UPIC -O2 -pipe -fno-common -I/workspace/src/contrib/llvm-project/lldb/include -I/workspace/src/contrib/llvm-project/lldb/source -I/tmp/obj/workspace/src/amd64.amd64/lib/clang/libllvm -I/tmp/obj/workspace/src/amd64.amd64/lib/clang/libclang -I/tmp/obj/workspace/src/amd64.amd64/lib/clang/liblldb -I/workspace/src/contrib/lua/src -I/workspace/src/lib/liblua -I/workspace/src/contrib/llvm-project/clang/include -DCLANG_ENABLE_STATIC_ANALYZER -I/workspace/src/lib/clang/include -I/workspace/src/contrib/llvm-project/llvm/include -D__STDC_CONSTANT_MACROS -D__STDC_FORMAT_MACROS -D__STDC_LIMIT_MACROS -DHAVE_VCS_VERSION_INC -DLLVM_DEFAULT_TARGET_TRIPLE=\"x86_64-unknown-freebsd16.0\" -DLLVM_HOST_TRIPLE=\"x86_64-unknown-freebsd16.0\" -DDEFAULT_SYSROOT=\"\" -DLLVM_TARGET_ENABLE_AARCH64 -DLLVM_TARGET_ENABLE_ARM -DLLVM_TARGET_ENABLE_POWERPC -DLLVM_TARGET_ENABLE_RISCV -DLLVM_TARGET_ENABLE_X86 -DLLVM_NATIVE_ASMPARSER=LLVMInitializeX86AsmParser -DLLVM_NATIVE_ASMPRINTER=LLVMInitializeX86AsmPrinter -DLLVM_NATIVE_DISASSEMBLER=LLVMInitializeX86Disassembler -DLLVM_NATIVE_TARGET=LLVMInitializeX86Target -DLLVM_NATIVE_TARGETINFO=LLVMInitializeX86TargetInfo -DLLVM_NATIVE_TARGETMC=LLVMInitializeX86TargetMC -ffunction-sections -fdata-sections -g1 -MD -MF.depend.Core_Address.pico -MTCore/Address.pico -Wno-format-zero-length -fstack-protector-strong -Wdate-time -Wno-error=address -Wno-error=array-bounds -Wno-error=attributes -Wno-error=bool-compare -Wno-error=cast-align -Wno-error=clobbered -Wno-error=deprecated-declarations -Wno-error=enum-compare -Wno-error=extra -Wno-error=logical-not-parentheses -Wno-error=strict-aliasing -Wno-error=uninitialized -Wno-error=unused-function -Wno-error=unused-value -Wno-error=empty-body -Wno-error=maybe-uninitialized -Wno-error=nonnull-compare -Wno-error=shift-negative-value -Wno-error=tautological-compare -Wno-error=unused-const-variable -Wno-error=bool-operation -Wno-error=deprecated -Wno-error=expansion-to-defined -Wno-error=format-overflow -Wno-error=format-truncation -Wno-error=implicit-fallthrough -Wno-error=int-in-bool-context -Wno-error=memset-elt-size -Wno-error=noexcept-type -Wno-error=nonnull -Wno-error=pointer-compare -Wno-error=stringop-overflow -Wno-error=aggressive-loop-optimizations -Wno-error=cast-function-type -Wno-error=catch-value -Wno-error=multistatement-macros -Wno-error=restrict -Wno-error=sizeof-pointer-memaccess -Wno-error=stringop-truncation -Wno-return-type -Wno-address-of-packed-member -fno-strict-aliasing   -fno-exceptions -fno-rtti -fvisibility-inlines-hidden -g1 -std=c++17  -Wno-attributes -Wno-deprecated-declarations -Wno-error=class-memaccess -Wno-literal-suffix -Wno-c++20-extensions -Wno-attributes -Wno-error=unknown-pragmas -Wno-dangling-reference        -c /workspace/src/contrib/llvm-project/lldb/source/Core/Address.cpp -o Core/Address.pico
--- Core/AddressRange.pico ---
/usr/local/bin/x86_64-unknown-freebsd15.1-g++14  --sysroot=/tmp/obj/workspace/src/amd64.amd64/tmp -B/usr/local/x86_64-unknown-freebsd15.1/bin/ -fpic -DPIC  -UPIC -O2 -pipe -fno-common -I/workspace/src/contrib/llvm-project/lldb/include -I/workspace/src/contrib/llvm-project/lldb/source -I/tmp/obj/workspace/src/amd64.amd64/lib/clang/libllvm -I/tmp/obj/workspace/src/amd64.amd64/lib/clang/libclang -I/tmp/obj/workspace/src/amd64.amd64/lib/clang/liblldb -I/workspace/src/contrib/lua/src -I/workspace/src/lib/liblua -I/workspace/src/contrib/llvm-project/clang/include -DCLANG_ENABLE_STATIC_ANALYZER -I/workspace/src/lib/clang/include -I/workspace/src/contrib/llvm-project/llvm/include -D__STDC_CONSTANT_MACROS -D__STDC_FORMAT_MACROS -D__STDC_LIMIT_MACROS -DHAVE_VCS_VERSION_INC -DLLVM_DEFAULT_TARGET_TRIPLE=\"x86_64-unknown-freebsd16.0\" -DLLVM_HOST_TRIPLE=\"x86_64-unknown-freebsd16.0\" -DDEFAULT_SYSROOT=\"\" -DLLVM_TARGET_ENABLE_AARCH64 -DLLVM_TARGET_ENABLE_ARM -DLLVM_TARGET_ENABLE_POWERPC -DLLVM_TARGET_ENABLE_RISCV -DLLVM_TARGET_ENABLE_X86 -DLLVM_NATIVE_ASMPARSER=LLVMInitializeX86AsmParser -DLLVM_NATIVE_ASMPRINTER=LLVMInitializeX86AsmPrinter -DLLVM_NATIVE_DISASSEMBLER=LLVMInitializeX86Disassembler -DLLVM_NATIVE_TARGET=LLVMInitializeX86Target -DLLVM_NATIVE_TARGETINFO=LLVMInitializeX86TargetInfo -DLLVM_NATIVE_TARGETMC=LLVMInitializeX86TargetMC -ffunction-sections -fdata-sections -g1 -MD -MF.depend.Core_AddressRange.pico -MTCore/AddressRange.pico -Wno-format-zero-length -fstack-protector-strong -Wdate-time -Wno-error=address -Wno-error=array-bounds -Wno-error=attributes -Wno-error=bool-compare -Wno-error=cast-align -Wno-error=clobbered -Wno-error=deprecated-declarations -Wno-error=enum-compare -Wno-error=extra -Wno-error=logical-not-parentheses -Wno-error=strict-aliasing -Wno-error=uninitialized -Wno-error=unused-function -Wno-error=unused-value -Wno-error=empty-body -Wno-error=maybe-uninitialized -Wno-error=nonnull-compare -Wno-error=shift-negative-value -Wno-error=tautological-compare -Wno-error=unused-const-variable -Wno-error=bool-operation -Wno-error=deprecated -Wno-error=expansion-to-defined -Wno-error=format-overflow -Wno-error=format-truncation -Wno-error=implicit-fallthrough -Wno-error=int-in-bool-context -Wno-error=memset-elt-size -Wno-error=noexcept-type -Wno-error=nonnull -Wno-error=pointer-compare -Wno-error=stringop-overflow -Wno-error=aggressive-loop-optimizations -Wno-error=cast-function-type -Wno-error=catch-value -Wno-error=multistatement-macros -Wno-error=restrict -Wno-error=sizeof-pointer-memaccess -Wno-error=stringop-truncation -Wno-return-type -Wno-address-of-packed-member -fno-strict-aliasing   -fno-exceptions -fno-rtti -fvisibility-inlines-hidden -g1 -std=c++17  -Wno-attributes -Wno-deprecated-declarations -Wno-error=class-memaccess -Wno-literal-suffix -Wno-c++20-extensions -Wno-attributes -Wno-error=unknown-pragmas -Wno-dangling-reference        -c /workspace/src/contrib/llvm-project/lldb/source/Core/AddressRange.cpp -o Core/AddressRange.pico
--- Core/AddressRangeListImpl.pico ---
/usr/local/bin/x86_64-unknown-freebsd15.1-g++14  --sysroot=/tmp/obj/workspace/src/amd64.amd64/tmp -B/usr/local/x86_64-unknown-freebsd15.1/bin/ -fpic -DPIC  -UPIC -O2 -pipe -fno-common -I/workspace/src/contrib/llvm-project/lldb/include -I/workspace/src/contrib/llvm-project/lldb/source -I/tmp/obj/workspace/src/amd64.amd64/lib/clang/libllvm -I/tmp/obj/workspace/src/amd64.amd64/lib/clang/libclang -I/tmp/obj/workspace/src/amd64.amd64/lib/clang/liblldb -I/workspace/src/contrib/lua/src -I/workspace/src/lib/liblua -I/workspace/src/contrib/llvm-project/clang/include -DCLANG_ENABLE_STATIC_ANALYZER -I/workspace/src/lib/clang/include -I/workspace/src/contrib/llvm-project/llvm/include -D__STDC_CONSTANT_MACROS -D__STDC_FORMAT_MACROS -D__STDC_LIMIT_MACROS -DHAVE_VCS_VERSION_INC -DLLVM_DEFAULT_TARGET_TRIPLE=\"x86_64-unknown-freebsd16.0\" -DLLVM_HOST_TRIPLE=\"x86_64-unknown-freebsd16.0\" -DDEFAULT_SYSROOT=\"\" -DLLVM_TARGET_ENABLE_AARCH64 -DLLVM_TARGET_ENABLE_ARM -DLLVM_TARGET_ENABLE_POWERPC -DLLVM_TARGET_ENABLE_RISCV -DLLVM_TARGET_ENABLE_X86 -DLLVM_NATIVE_ASMPARSER=LLVMInitializeX86AsmParser -DLLVM_NATIVE_ASMPRINTER=LLVMInitializeX86AsmPrinter -DLLVM_NATIVE_DISASSEMBLER=LLVMInitializeX86Disassembler -DLLVM_NATIVE_TARGET=LLVMInitializeX86Target -DLLVM_NATIVE_TARGETINFO=LLVMInitializeX86TargetInfo -DLLVM_NATIVE_TARGETMC=LLVMInitializeX86TargetMC -ffunction-sections -fdata-sections -g1 -MD -MF.depend.Core_AddressRangeListImpl.pico -MTCore/AddressRangeListImpl.pico -Wno-format-zero-length -fstack-protector-strong -Wdate-time -Wno-error=address -Wno-error=array-bounds -Wno-error=attributes -Wno-error=bool-compare -Wno-error=cast-align -Wno-error=clobbered -Wno-error=deprecated-declarations -Wno-error=enum-compare -Wno-error=extra -Wno-error=logical-not-parentheses -Wno-error=strict-aliasing -Wno-error=uninitialized -Wno-error=unused-function -Wno-error=unused-value -Wno-error=empty-body -Wno-error=maybe-uninitialized -Wno-error=nonnull-compare -Wno-error=shift-negative-value -Wno-error=tautological-compare -Wno-error=unused-const-variable -Wno-error=bool-operation -Wno-error=deprecated -Wno-error=expansion-to-defined -Wno-error=format-overflow -Wno-error=format-truncation -Wno-error=implicit-fallthrough -Wno-error=int-in-bool-context -Wno-error=memset-elt-size -Wno-error=noexcept-type -Wno-error=nonnull -Wno-error=pointer-compare -Wno-error=stringop-overflow -Wno-error=aggressive-loop-optimizations -Wno-error=cast-function-type -Wno-error=catch-value -Wno-error=multistatement-macros -Wno-error=restrict -Wno-error=sizeof-pointer-memaccess -Wno-error=stringop-truncation -Wno-return-type -Wno-address-of-packed-member -fno-strict-aliasing   -fno-exceptions -fno-rtti -fvisibility-inlines-hidden -g1 -std=c++17  -Wno-attributes -Wno-deprecated-declarations -Wno-error=class-memaccess -Wno-literal-suffix -Wno-c++20-extensions -Wno-attributes -Wno-error=unknown-pragmas -Wno-dangling-reference        -c /workspace/src/contrib/llvm-project/lldb/source/Core/AddressRangeListImpl.cpp -o Core/AddressRangeListImpl.pico
--- Core/AddressResolver.pico ---
/usr/local/bin/x86_64-unknown-freebsd15.1-g++14  --sysroot=/tmp/obj/workspace/src/amd64.amd64/tmp -B/usr/local/x86_64-unknown-freebsd15.1/bin/ -fpic -DPIC  -UPIC -O2 -pipe -fno-common -I/workspace/src/contrib/llvm-project/lldb/include -I/workspace/src/contrib/llvm-project/lldb/source -I/tmp/obj/workspace/src/amd64.amd64/lib/clang/libllvm -I/tmp/obj/workspace/src/amd64.amd64/lib/clang/libclang -I/tmp/obj/workspace/src/amd64.amd64/lib/clang/liblldb -I/workspace/src/contrib/lua/src -I/workspace/src/lib/liblua -I/workspace/src/contrib/llvm-project/clang/include -DCLANG_ENABLE_STATIC_ANALYZER -I/workspace/src/lib/clang/include -I/workspace/src/contrib/llvm-project/llvm/include -D__STDC_CONSTANT_MACROS -D__STDC_FORMAT_MACROS -D__STDC_LIMIT_MACROS -DHAVE_VCS_VERSION_INC -DLLVM_DEFAULT_TARGET_TRIPLE=\"x86_64-unknown-freebsd16.0\" -DLLVM_HOST_TRIPLE=\"x86_64-unknown-freebsd16.0\" -DDEFAULT_SYSROOT=\"\" -DLLVM_TARGET_ENABLE_AARCH64 -DLLVM_TARGET_ENABLE_ARM -DLLVM_TARGET_ENABLE_POWERPC -DLLVM_TARGET_ENABLE_RISCV -DLLVM_TARGET_ENABLE_X86 -DLLVM_NATIVE_ASMPARSER=LLVMInitializeX86AsmParser -DLLVM_NATIVE_ASMPRINTER=LLVMInitializeX86AsmPrinter -DLLVM_NATIVE_DISASSEMBLER=LLVMInitializeX86Disassembler -DLLVM_NATIVE_TARGET=LLVMInitializeX86Target -DLLVM_NATIVE_TARGETINFO=LLVMInitializeX86TargetInfo -DLLVM_NATIVE_TARGETMC=LLVMInitializeX86TargetMC -ffunction-sections -fdata-sections -g1 -MD -MF.depend.Core_AddressResolver.pico -MTCore/AddressResolver.pico -Wno-format-zero-length -fstack-protector-strong -Wdate-time -Wno-error=address -Wno-error=array-bounds -Wno-error=attributes -Wno-error=bool-compare -Wno-error=cast-align -Wno-error=clobbered -Wno-error=deprecated-declarations -Wno-error=enum-compare -Wno-error=extra -Wno-error=logical-not-parentheses -Wno-error=strict-aliasing -Wno-error=uninitialized -Wno-error=unused-function -Wno-error=unused-value -Wno-error=empty-body -Wno-error=maybe-uninitialized -Wno-error=nonnull-compare -Wno-error=shift-negative-value -Wno-error=tautological-compare -Wno-error=unused-const-variable -Wno-error=bool-operation -Wno-error=deprecated -Wno-error=expansion-to-defined -Wno-error=format-overflow -Wno-error=format-truncation -Wno-error=implicit-fallthrough -Wno-error=int-in-bool-context -Wno-error=memset-elt-size -Wno-error=noexcept-type -Wno-error=nonnull -Wno-error=pointer-compare -Wno-error=stringop-overflow -Wno-error=aggressive-loop-optimizations -Wno-error=cast-function-type -Wno-error=catch-value -Wno-error=multistatement-macros -Wno-error=restrict -Wno-error=sizeof-pointer-memaccess -Wno-error=stringop-truncation -Wno-return-type -Wno-address-of-packed-member -fno-strict-aliasing   -fno-exceptions -fno-rtti -fvisibility-inlines-hidden -g1 -std=c++17  -Wno-attributes -Wno-deprecated-declarations -Wno-error=class-memaccess -Wno-literal-suffix -Wno-c++20-extensions -Wno-attributes -Wno-error=unknown-pragmas -Wno-dangling-reference        -c /workspace/src/contrib/llvm-project/lldb/source/Core/AddressResolver.cpp -o Core/AddressResolver.pico
--- Core/AddressResolverFileLine.pico ---
/usr/local/bin/x86_64-unknown-freebsd15.1-g++14  --sysroot=/tmp/obj/workspace/src/amd64.amd64/tmp -B/usr/local/x86_64-unknown-freebsd15.1/bin/ -fpic -DPIC  -UPIC -O2 -pipe -fno-common -I/workspace/src/contrib/llvm-project/lldb/include -I/workspace/src/contrib/llvm-project/lldb/source -I/tmp/obj/workspace/src/amd64.amd64/lib/clang/libllvm -I/tmp/obj/workspace/src/amd64.amd64/lib/clang/libclang -I/tmp/obj/workspace/src/amd64.amd64/lib/clang/liblldb -I/workspace/src/contrib/lua/src -I/workspace/src/lib/liblua -I/workspace/src/contrib/llvm-project/clang/include -DCLANG_ENABLE_STATIC_ANALYZER -I/workspace/src/lib/clang/include -I/workspace/src/contrib/llvm-project/llvm/include -D__STDC_CONSTANT_MACROS -D__STDC_FORMAT_MACROS -D__STDC_LIMIT_MACROS -DHAVE_VCS_VERSION_INC -DLLVM_DEFAULT_TARGET_TRIPLE=\"x86_64-unknown-freebsd16.0\" -DLLVM_HOST_TRIPLE=\"x86_64-unknown-freebsd16.0\" -DDEFAULT_SYSROOT=\"\" -DLLVM_TARGET_ENABLE_AARCH64 -DLLVM_TARGET_ENABLE_ARM -DLLVM_TARGET_ENABLE_POWERPC -DLLVM_TARGET_ENABLE_RISCV -DLLVM_TARGET_ENABLE_X86 -DLLVM_NATIVE_ASMPARSER=LLVMInitializeX86AsmParser -DLLVM_NATIVE_ASMPRINTER=LLVMInitializeX86AsmPrinter -DLLVM_NATIVE_DISASSEMBLER=LLVMInitializeX86Disassembler -DLLVM_NATIVE_TARGET=LLVMInitializeX86Target -DLLVM_NATIVE_TARGETINFO=LLVMInitializeX86TargetInfo -DLLVM_NATIVE_TARGETMC=LLVMInitializeX86TargetMC -ffunction-sections -fdata-sections -g1 -MD -MF.depend.Core_AddressResolverFileLine.pico -MTCore/AddressResolverFileLine.pico -Wno-format-zero-length -fstack-protector-strong -Wdate-time -Wno-error=address -Wno-error=array-bounds -Wno-error=attributes -Wno-error=bool-compare -Wno-error=cast-align -Wno-error=clobbered -Wno-error=deprecated-declarations -Wno-error=enum-compare -Wno-error=extra -Wno-error=logical-not-parentheses -Wno-error=strict-aliasing -Wno-error=uninitialized -Wno-error=unused-function -Wno-error=unused-value -Wno-error=empty-body -Wno-error=maybe-uninitialized -Wno-error=nonnull-compare -Wno-error=shift-negative-value -Wno-error=tautological-compare -Wno-error=unused-const-variable -Wno-error=bool-operation -Wno-error=deprecated -Wno-error=expansion-to-defined -Wno-error=format-overflow -Wno-error=format-truncation -Wno-error=implicit-fallthrough -Wno-error=int-in-bool-context -Wno-error=memset-elt-size -Wno-error=noexcept-type -Wno-error=nonnull -Wno-error=pointer-compare -Wno-error=stringop-overflow -Wno-error=aggressive-loop-optimizations -Wno-error=cast-function-type -Wno-error=catch-value -Wno-error=multistatement-macros -Wno-error=restrict -Wno-error=sizeof-pointer-memaccess -Wno-error=stringop-truncation -Wno-return-type -Wno-address-of-packed-member -fno-strict-aliasing   -fno-exceptions -fno-rtti -fvisibility-inlines-hidden -g1 -std=c++17  -Wno-attributes -Wno-deprecated-declarations -Wno-error=class-memaccess -Wno-literal-suffix -Wno-c++20-extensions -Wno-attributes -Wno-error=unknown-pragmas -Wno-dangling-reference        -c /workspace/src/contrib/llvm-project/lldb/source/Core/AddressResolverFileLine.cpp -o Core/AddressResolverFileLine.pico
--- Core/Communication.pico ---
/usr/local/bin/x86_64-unknown-freebsd15.1-g++14  --sysroot=/tmp/obj/workspace/src/amd64.amd64/tmp -B/usr/local/x86_64-unknown-freebsd15.1/bin/ -fpic -DPIC  -UPIC -O2 -pipe -fno-common -I/workspace/src/contrib/llvm-project/lldb/include -I/workspace/src/contrib/llvm-project/lldb/source -I/tmp/obj/workspace/src/amd64.amd64/lib/clang/libllvm -I/tmp/obj/workspace/src/amd64.amd64/lib/clang/libclang -I/tmp/obj/workspace/src/amd64.amd64/lib/clang/liblldb -I/workspace/src/contrib/lua/src -I/workspace/src/lib/liblua -I/workspace/src/contrib/llvm-project/clang/include -DCLANG_ENABLE_STATIC_ANALYZER -I/workspace/src/lib/clang/include -I/workspace/src/contrib/llvm-project/llvm/include -D__STDC_CONSTANT_MACROS -D__STDC_FORMAT_MACROS -D__STDC_LIMIT_MACROS -DHAVE_VCS_VERSION_INC -DLLVM_DEFAULT_TARGET_TRIPLE=\"x86_64-unknown-freebsd16.0\" -DLLVM_HOST_TRIPLE=\"x86_64-unknown-freebsd16.0\" -DDEFAULT_SYSROOT=\"\" -DLLVM_TARGET_ENABLE_AARCH64 -DLLVM_TARGET_ENABLE_ARM -DLLVM_TARGET_ENABLE_POWERPC -DLLVM_TARGET_ENABLE_RISCV -DLLVM_TARGET_ENABLE_X86 -DLLVM_NATIVE_ASMPARSER=LLVMInitializeX86AsmParser -DLLVM_NATIVE_ASMPRINTER=LLVMInitializeX86AsmPrinter -DLLVM_NATIVE_DISASSEMBLER=LLVMInitializeX86Disassembler -DLLVM_NATIVE_TARGET=LLVMInitializeX86Target -DLLVM_NATIVE_TARGETINFO=LLVMInitializeX86TargetInfo -DLLVM_NATIVE_TARGETMC=LLVMInitializeX86TargetMC -ffunction-sections -fdata-sections -g1 -MD -MF.depend.Core_Communication.pico -MTCore/Communication.pico -Wno-format-zero-length -fstack-protector-strong -Wdate-time -Wno-error=address -Wno-error=array-bounds -Wno-error=attributes -Wno-error=bool-compare -Wno-error=cast-align -Wno-error=clobbered -Wno-error=deprecated-declarations -Wno-error=enum-compare -Wno-error=extra -Wno-error=logical-not-parentheses -Wno-error=strict-aliasing -Wno-error=uninitialized -Wno-error=unused-function -Wno-error=unused-value -Wno-error=empty-body -Wno-error=maybe-uninitialized -Wno-error=nonnull-compare -Wno-error=shift-negative-value -Wno-error=tautological-compare -Wno-error=unused-const-variable -Wno-error=bool-operation -Wno-error=deprecated -Wno-error=expansion-to-defined -Wno-error=format-overflow -Wno-error=format-truncation -Wno-error=implicit-fallthrough -Wno-error=int-in-bool-context -Wno-error=memset-elt-size -Wno-error=noexcept-type -Wno-error=nonnull -Wno-error=pointer-compare -Wno-error=stringop-overflow -Wno-error=aggressive-loop-optimizations -Wno-error=cast-function-type -Wno-error=catch-value -Wno-error=multistatement-macros -Wno-error=restrict -Wno-error=sizeof-pointer-memaccess -Wno-error=stringop-truncation -Wno-return-type -Wno-address-of-packed-member -fno-strict-aliasing   -fno-exceptions -fno-rtti -fvisibility-inlines-hidden -g1 -std=c++17  -Wno-attributes -Wno-deprecated-declarations -Wno-error=class-memaccess -Wno-literal-suffix -Wno-c++20-extensions -Wno-attributes -Wno-error=unknown-pragmas -Wno-dangling-reference        -c /workspace/src/contrib/llvm-project/lldb/source/Core/Communication.cpp -o Core/Communication.pico
--- Core/DataFileCache.pico ---
/usr/local/bin/x86_64-unknown-freebsd15.1-g++14  --sysroot=/tmp/obj/workspace/src/amd64.amd64/tmp -B/usr/local/x86_64-unknown-freebsd15.1/bin/ -fpic -DPIC  -UPIC -O2 -pipe -fno-common -I/workspace/src/contrib/llvm-project/lldb/include -I/workspace/src/contrib/llvm-project/lldb/source -I/tmp/obj/workspace/src/amd64.amd64/lib/clang/libllvm -I/tmp/obj/workspace/src/amd64.amd64/lib/clang/libclang -I/tmp/obj/workspace/src/amd64.amd64/lib/clang/liblldb -I/workspace/src/contrib/lua/src -I/workspace/src/lib/liblua -I/workspace/src/contrib/llvm-project/clang/include -DCLANG_ENABLE_STATIC_ANALYZER -I/workspace/src/lib/clang/include -I/workspace/src/contrib/llvm-project/llvm/include -D__STDC_CONSTANT_MACROS -D__STDC_FORMAT_MACROS -D__STDC_LIMIT_MACROS -DHAVE_VCS_VERSION_INC -DLLVM_DEFAULT_TARGET_TRIPLE=\"x86_64-unknown-freebsd16.0\" -DLLVM_HOST_TRIPLE=\"x86_64-unknown-freebsd16.0\" -DDEFAULT_SYSROOT=\"\" -DLLVM_TARGET_ENABLE_AARCH64 -DLLVM_TARGET_ENABLE_ARM -DLLVM_TARGET_ENABLE_POWERPC -DLLVM_TARGET_ENABLE_RISCV -DLLVM_TARGET_ENABLE_X86 -DLLVM_NATIVE_ASMPARSER=LLVMInitializeX86AsmParser -DLLVM_NATIVE_ASMPRINTER=LLVMInitializeX86AsmPrinter -DLLVM_NATIVE_DISASSEMBLER=LLVMInitializeX86Disassembler -DLLVM_NATIVE_TARGET=LLVMInitializeX86Target -DLLVM_NATIVE_TARGETINFO=LLVMInitializeX86TargetInfo -DLLVM_NATIVE_TARGETMC=LLVMInitializeX86TargetMC -ffunction-sections -fdata-sections -g1 -MD -MF.depend.Core_DataFileCache.pico -MTCore/DataFileCache.pico -Wno-format-zero-length -fstack-protector-strong -Wdate-time -Wno-error=address -Wno-error=array-bounds -Wno-error=attributes -Wno-error=bool-compare -Wno-error=cast-align -Wno-error=clobbered -Wno-error=deprecated-declarations -Wno-error=enum-compare -Wno-error=extra -Wno-error=logical-not-parentheses -Wno-error=strict-aliasing -Wno-error=uninitialized -Wno-error=unused-function -Wno-error=unused-value -Wno-error=empty-body -Wno-error=maybe-uninitialized -Wno-error=nonnull-compare -Wno-error=shift-negative-value -Wno-error=tautological-compare -Wno-error=unused-const-variable -Wno-error=bool-operation -Wno-error=deprecated -Wno-error=expansion-to-defined -Wno-error=format-overflow -Wno-error=format-truncation -Wno-error=implicit-fallthrough -Wno-error=int-in-bool-context -Wno-error=memset-elt-size -Wno-error=noexcept-type -Wno-error=nonnull -Wno-error=pointer-compare -Wno-error=stringop-overflow -Wno-error=aggressive-loop-optimizations -Wno-error=cast-function-type -Wno-error=catch-value -Wno-error=multistatement-macros -Wno-error=restrict -Wno-error=sizeof-pointer-memaccess -Wno-error=stringop-truncation -Wno-return-type -Wno-address-of-packed-member -fno-strict-aliasing   -fno-exceptions -fno-rtti -fvisibility-inlines-hidden -g1 -std=c++17  -Wno-attributes -Wno-deprecated-declarations -Wno-error=class-memaccess -Wno-literal-suffix -Wno-c++20-extensions -Wno-attributes -Wno-error=unknown-pragmas -Wno-dangling-reference        -c /workspace/src/contrib/llvm-project/lldb/source/Core/DataFileCache.cpp -o Core/DataFileCache.pico
--- Core/Debugger.pico ---
/usr/local/bin/x86_64-unknown-freebsd15.1-g++14  --sysroot=/tmp/obj/workspace/src/amd64.amd64/tmp -B/usr/local/x86_64-unknown-freebsd15.1/bin/ -fpic -DPIC  -UPIC -O2 -pipe -fno-common -I/workspace/src/contrib/llvm-project/lldb/include -I/workspace/src/contrib/llvm-project/lldb/source -I/tmp/obj/workspace/src/amd64.amd64/lib/clang/libllvm -I/tmp/obj/workspace/src/amd64.amd64/lib/clang/libclang -I/tmp/obj/workspace/src/amd64.amd64/lib/clang/liblldb -I/workspace/src/contrib/lua/src -I/workspace/src/lib/liblua -I/workspace/src/contrib/llvm-project/clang/include -DCLANG_ENABLE_STATIC_ANALYZER -I/workspace/src/lib/clang/include -I/workspace/src/contrib/llvm-project/llvm/include -D__STDC_CONSTANT_MACROS -D__STDC_FORMAT_MACROS -D__STDC_LIMIT_MACROS -DHAVE_VCS_VERSION_INC -DLLVM_DEFAULT_TARGET_TRIPLE=\"x86_64-unknown-freebsd16.0\" -DLLVM_HOST_TRIPLE=\"x86_64-unknown-freebsd16.0\" -DDEFAULT_SYSROOT=\"\" -DLLVM_TARGET_ENABLE_AARCH64 -DLLVM_TARGET_ENABLE_ARM -DLLVM_TARGET_ENABLE_POWERPC -DLLVM_TARGET_ENABLE_RISCV -DLLVM_TARGET_ENABLE_X86 -DLLVM_NATIVE_ASMPARSER=LLVMInitializeX86AsmParser -DLLVM_NATIVE_ASMPRINTER=LLVMInitializeX86AsmPrinter -DLLVM_NATIVE_DISASSEMBLER=LLVMInitializeX86Disassembler -DLLVM_NATIVE_TARGET=LLVMInitializeX86Target -DLLVM_NATIVE_TARGETINFO=LLVMInitializeX86TargetInfo -DLLVM_NATIVE_TARGETMC=LLVMInitializeX86TargetMC -ffunction-sections -fdata-sections -g1 -MD -MF.depend.Core_Debugger.pico -MTCore/Debugger.pico -Wno-format-zero-length -fstack-protector-strong -Wdate-time -Wno-error=address -Wno-error=array-bounds -Wno-error=attributes -Wno-error=bool-compare -Wno-error=cast-align -Wno-error=clobbered -Wno-error=deprecated-declarations -Wno-error=enum-compare -Wno-error=extra -Wno-error=logical-not-parentheses -Wno-error=strict-aliasing -Wno-error=uninitialized -Wno-error=unused-function -Wno-error=unused-value -Wno-error=empty-body -Wno-error=maybe-uninitialized -Wno-error=nonnull-compare -Wno-error=shift-negative-value -Wno-error=tautological-compare -Wno-error=unused-const-variable -Wno-error=bool-operation -Wno-error=deprecated -Wno-error=expansion-to-defined -Wno-error=format-overflow -Wno-error=format-truncation -Wno-error=implicit-fallthrough -Wno-error=int-in-bool-context -Wno-error=memset-elt-size -Wno-error=noexcept-type -Wno-error=nonnull -Wno-error=pointer-compare -Wno-error=stringop-overflow -Wno-error=aggressive-loop-optimizations -Wno-error=cast-function-type -Wno-error=catch-value -Wno-error=multistatement-macros -Wno-error=restrict -Wno-error=sizeof-pointer-memaccess -Wno-error=stringop-truncation -Wno-return-type -Wno-address-of-packed-member -fno-strict-aliasing   -fno-exceptions -fno-rtti -fvisibility-inlines-hidden -g1 -std=c++17  -Wno-attributes -Wno-deprecated-declarations -Wno-error=class-memaccess -Wno-literal-suffix -Wno-c++20-extensions -Wno-attributes -Wno-error=unknown-pragmas -Wno-dangling-reference        -c /workspace/src/contrib/llvm-project/lldb/source/Core/Debugger.cpp -o Core/Debugger.pico
--- Core/DebuggerEvents.pico ---
/usr/local/bin/x86_64-unknown-freebsd15.1-g++14  --sysroot=/tmp/obj/workspace/src/amd64.amd64/tmp -B/usr/local/x86_64-unknown-freebsd15.1/bin/ -fpic -DPIC  -UPIC -O2 -pipe -fno-common -I/workspace/src/contrib/llvm-project/lldb/include -I/workspace/src/contrib/llvm-project/lldb/source -I/tmp/obj/workspace/src/amd64.amd64/lib/clang/libllvm -I/tmp/obj/workspace/src/amd64.amd64/lib/clang/libclang -I/tmp/obj/workspace/src/amd64.amd64/lib/clang/liblldb -I/workspace/src/contrib/lua/src -I/workspace/src/lib/liblua -I/workspace/src/contrib/llvm-project/clang/include -DCLANG_ENABLE_STATIC_ANALYZER -I/workspace/src/lib/clang/include -I/workspace/src/contrib/llvm-project/llvm/include -D__STDC_CONSTANT_MACROS -D__STDC_FORMAT_MACROS -D__STDC_LIMIT_MACROS -DHAVE_VCS_VERSION_INC -DLLVM_DEFAULT_TARGET_TRIPLE=\"x86_64-unknown-freebsd16.0\" -DLLVM_HOST_TRIPLE=\"x86_64-unknown-freebsd16.0\" -DDEFAULT_SYSROOT=\"\" -DLLVM_TARGET_ENABLE_AARCH64 -DLLVM_TARGET_ENABLE_ARM -DLLVM_TARGET_ENABLE_POWERPC -DLLVM_TARGET_ENABLE_RISCV -DLLVM_TARGET_ENABLE_X86 -DLLVM_NATIVE_ASMPARSER=LLVMInitializeX86AsmParser -DLLVM_NATIVE_ASMPRINTER=LLVMInitializeX86AsmPrinter -DLLVM_NATIVE_DISASSEMBLER=LLVMInitializeX86Disassembler -DLLVM_NATIVE_TARGET=LLVMInitializeX86Target -DLLVM_NATIVE_TARGETINFO=LLVMInitializeX86TargetInfo -DLLVM_NATIVE_TARGETMC=LLVMInitializeX86TargetMC -ffunction-sections -fdata-sections -g1 -MD -MF.depend.Core_DebuggerEvents.pico -MTCore/DebuggerEvents.pico -Wno-format-zero-length -fstack-protector-strong -Wdate-time -Wno-error=address -Wno-error=array-bounds -Wno-error=attributes -Wno-error=bool-compare -Wno-error=cast-align -Wno-error=clobbered -Wno-error=deprecated-declarations -Wno-error=enum-compare -Wno-error=extra -Wno-error=logical-not-parentheses -Wno-error=strict-aliasing -Wno-error=uninitialized -Wno-error=unused-function -Wno-error=unused-value -Wno-error=empty-body -Wno-error=maybe-uninitialized -Wno-error=nonnull-compare -Wno-error=shift-negative-value -Wno-error=tautological-compare -Wno-error=unused-const-variable -Wno-error=bool-operation -Wno-error=deprecated -Wno-error=expansion-to-defined -Wno-error=format-overflow -Wno-error=format-truncation -Wno-error=implicit-fallthrough -Wno-error=int-in-bool-context -Wno-error=memset-elt-size -Wno-error=noexcept-type -Wno-error=nonnull -Wno-error=pointer-compare -Wno-error=stringop-overflow -Wno-error=aggressive-loop-optimizations -Wno-error=cast-function-type -Wno-error=catch-value -Wno-error=multistatement-macros -Wno-error=restrict -Wno-error=sizeof-pointer-memaccess -Wno-error=stringop-truncation -Wno-return-type -Wno-address-of-packed-member -fno-strict-aliasing   -fno-exceptions -fno-rtti -fvisibility-inlines-hidden -g1 -std=c++17  -Wno-attributes -Wno-deprecated-declarations -Wno-error=class-memaccess -Wno-literal-suffix -Wno-c++20-extensions -Wno-attributes -Wno-error=unknown-pragmas -Wno-dangling-reference        -c /workspace/src/contrib/llvm-project/lldb/source/Core/DebuggerEvents.cpp -o Core/DebuggerEvents.pico
--- Core/Declaration.pico ---
/usr/local/bin/x86_64-unknown-freebsd15.1-g++14  --sysroot=/tmp/obj/workspace/src/amd64.amd64/tmp -B/usr/local/x86_64-unknown-freebsd15.1/bin/ -fpic -DPIC  -UPIC -O2 -pipe -fno-common -I/workspace/src/contrib/llvm-project/lldb/include -I/workspace/src/contrib/llvm-project/lldb/source -I/tmp/obj/workspace/src/amd64.amd64/lib/clang/libllvm -I/tmp/obj/workspace/src/amd64.amd64/lib/clang/libclang -I/tmp/obj/workspace/src/amd64.amd64/lib/clang/liblldb -I/workspace/src/contrib/lua/src -I/workspace/src/lib/liblua -I/workspace/src/contrib/llvm-project/clang/include -DCLANG_ENABLE_STATIC_ANALYZER -I/workspace/src/lib/clang/include -I/workspace/src/contrib/llvm-project/llvm/include -D__STDC_CONSTANT_MACROS -D__STDC_FORMAT_MACROS -D__STDC_LIMIT_MACROS -DHAVE_VCS_VERSION_INC -DLLVM_DEFAULT_TARGET_TRIPLE=\"x86_64-unknown-freebsd16.0\" -DLLVM_HOST_TRIPLE=\"x86_64-unknown-freebsd16.0\" -DDEFAULT_SYSROOT=\"\" -DLLVM_TARGET_ENABLE_AARCH64 -DLLVM_TARGET_ENABLE_ARM -DLLVM_TARGET_ENABLE_POWERPC -DLLVM_TARGET_ENABLE_RISCV -DLLVM_TARGET_ENABLE_X86 -DLLVM_NATIVE_ASMPARSER=LLVMInitializeX86AsmParser -DLLVM_NATIVE_ASMPRINTER=LLVMInitializeX86AsmPrinter -DLLVM_NATIVE_DISASSEMBLER=LLVMInitializeX86Disassembler -DLLVM_NATIVE_TARGET=LLVMInitializeX86Target -DLLVM_NATIVE_TARGETINFO=LLVMInitializeX86TargetInfo -DLLVM_NATIVE_TARGETMC=LLVMInitializeX86TargetMC -ffunction-sections -fdata-sections -g1 -MD -MF.depend.Core_Declaration.pico -MTCore/Declaration.pico -Wno-format-zero-length -fstack-protector-strong -Wdate-time -Wno-error=address -Wno-error=array-bounds -Wno-error=attributes -Wno-error=bool-compare -Wno-error=cast-align -Wno-error=clobbered -Wno-error=deprecated-declarations -Wno-error=enum-compare -Wno-error=extra -Wno-error=logical-not-parentheses -Wno-error=strict-aliasing -Wno-error=uninitialized -Wno-error=unused-function -Wno-error=unused-value -Wno-error=empty-body -Wno-error=maybe-uninitialized -Wno-error=nonnull-compare -Wno-error=shift-negative-value -Wno-error=tautological-compare -Wno-error=unused-const-variable -Wno-error=bool-operation -Wno-error=deprecated -Wno-error=expansion-to-defined -Wno-error=format-overflow -Wno-error=format-truncation -Wno-error=implicit-fallthrough -Wno-error=int-in-bool-context -Wno-error=memset-elt-size -Wno-error=noexcept-type -Wno-error=nonnull -Wno-error=pointer-compare -Wno-error=stringop-overflow -Wno-error=aggressive-loop-optimizations -Wno-error=cast-function-type -Wno-error=catch-value -Wno-error=multistatement-macros -Wno-error=restrict -Wno-error=sizeof-pointer-memaccess -Wno-error=stringop-truncation -Wno-return-type -Wno-address-of-packed-member -fno-strict-aliasing   -fno-exceptions -fno-rtti -fvisibility-inlines-hidden -g1 -std=c++17  -Wno-attributes -Wno-deprecated-declarations -Wno-error=class-memaccess -Wno-literal-suffix -Wno-c++20-extensions -Wno-attributes -Wno-error=unknown-pragmas -Wno-dangling-reference        -c /workspace/src/contrib/llvm-project/lldb/source/Core/Declaration.cpp -o Core/Declaration.pico
--- Core/Disassembler.pico ---
/usr/local/bin/x86_64-unknown-freebsd15.1-g++14  --sysroot=/tmp/obj/workspace/src/amd64.amd64/tmp -B/usr/local/x86_64-unknown-freebsd15.1/bin/ -fpic -DPIC  -UPIC -O2 -pipe -fno-common -I/workspace/src/contrib/llvm-project/lldb/include -I/workspace/src/contrib/llvm-project/lldb/source -I/tmp/obj/workspace/src/amd64.amd64/lib/clang/libllvm -I/tmp/obj/workspace/src/amd64.amd64/lib/clang/libclang -I/tmp/obj/workspace/src/amd64.amd64/lib/clang/liblldb -I/workspace/src/contrib/lua/src -I/workspace/src/lib/liblua -I/workspace/src/contrib/llvm-project/clang/include -DCLANG_ENABLE_STATIC_ANALYZER -I/workspace/src/lib/clang/include -I/workspace/src/contrib/llvm-project/llvm/include -D__STDC_CONSTANT_MACROS -D__STDC_FORMAT_MACROS -D__STDC_LIMIT_MACROS -DHAVE_VCS_VERSION_INC -DLLVM_DEFAULT_TARGET_TRIPLE=\"x86_64-unknown-freebsd16.0\" -DLLVM_HOST_TRIPLE=\"x86_64-unknown-freebsd16.0\" -DDEFAULT_SYSROOT=\"\" -DLLVM_TARGET_ENABLE_AARCH64 -DLLVM_TARGET_ENABLE_ARM -DLLVM_TARGET_ENABLE_POWERPC -DLLVM_TARGET_ENABLE_RISCV -DLLVM_TARGET_ENABLE_X86 -DLLVM_NATIVE_ASMPARSER=LLVMInitializeX86AsmParser -DLLVM_NATIVE_ASMPRINTER=LLVMInitializeX86AsmPrinter -DLLVM_NATIVE_DISASSEMBLER=LLVMInitializeX86Disassembler -DLLVM_NATIVE_TARGET=LLVMInitializeX86Target -DLLVM_NATIVE_TARGETINFO=LLVMInitializeX86TargetInfo -DLLVM_NATIVE_TARGETMC=LLVMInitializeX86TargetMC -ffunction-sections -fdata-sections -g1 -MD -MF.depend.Core_Disassembler.pico -MTCore/Disassembler.pico -Wno-format-zero-length -fstack-protector-strong -Wdate-time -Wno-error=address -Wno-error=array-bounds -Wno-error=attributes -Wno-error=bool-compare -Wno-error=cast-align -Wno-error=clobbered -Wno-error=deprecated-declarations -Wno-error=enum-compare -Wno-error=extra -Wno-error=logical-not-parentheses -Wno-error=strict-aliasing -Wno-error=uninitialized -Wno-error=unused-function -Wno-error=unused-value -Wno-error=empty-body -Wno-error=maybe-uninitialized -Wno-error=nonnull-compare -Wno-error=shift-negative-value -Wno-error=tautological-compare -Wno-error=unused-const-variable -Wno-error=bool-operation -Wno-error=deprecated -Wno-error=expansion-to-defined -Wno-error=format-overflow -Wno-error=format-truncation -Wno-error=implicit-fallthrough -Wno-error=int-in-bool-context -Wno-error=memset-elt-size -Wno-error=noexcept-type -Wno-error=nonnull -Wno-error=pointer-compare -Wno-error=stringop-overflow -Wno-error=aggressive-loop-optimizations -Wno-error=cast-function-type -Wno-error=catch-value -Wno-error=multistatement-macros -Wno-error=restrict -Wno-error=sizeof-pointer-memaccess -Wno-error=stringop-truncation -Wno-return-type -Wno-address-of-packed-member -fno-strict-aliasing   -fno-exceptions -fno-rtti -fvisibility-inlines-hidden -g1 -std=c++17  -Wno-attributes -Wno-deprecated-declarations -Wno-error=class-memaccess -Wno-literal-suffix -Wno-c++20-extensions -Wno-attributes -Wno-error=unknown-pragmas -Wno-dangling-reference        -c /workspace/src/contrib/llvm-project/lldb/source/Core/Disassembler.cpp -o Core/Disassembler.pico
--- Core/DemangledNameInfo.pico ---
/usr/local/bin/x86_64-unknown-freebsd15.1-g++14  --sysroot=/tmp/obj/workspace/src/amd64.amd64/tmp -B/usr/local/x86_64-unknown-freebsd15.1/bin/ -fpic -DPIC  -UPIC -O2 -pipe -fno-common -I/workspace/src/contrib/llvm-project/lldb/include -I/workspace/src/contrib/llvm-project/lldb/source -I/tmp/obj/workspace/src/amd64.amd64/lib/clang/libllvm -I/tmp/obj/workspace/src/amd64.amd64/lib/clang/libclang -I/tmp/obj/workspace/src/amd64.amd64/lib/clang/liblldb -I/workspace/src/contrib/lua/src -I/workspace/src/lib/liblua -I/workspace/src/contrib/llvm-project/clang/include -DCLANG_ENABLE_STATIC_ANALYZER -I/workspace/src/lib/clang/include -I/workspace/src/contrib/llvm-project/llvm/include -D__STDC_CONSTANT_MACROS -D__STDC_FORMAT_MACROS -D__STDC_LIMIT_MACROS -DHAVE_VCS_VERSION_INC -DLLVM_DEFAULT_TARGET_TRIPLE=\"x86_64-unknown-freebsd16.0\" -DLLVM_HOST_TRIPLE=\"x86_64-unknown-freebsd16.0\" -DDEFAULT_SYSROOT=\"\" -DLLVM_TARGET_ENABLE_AARCH64 -DLLVM_TARGET_ENABLE_ARM -DLLVM_TARGET_ENABLE_POWERPC -DLLVM_TARGET_ENABLE_RISCV -DLLVM_TARGET_ENABLE_X86 -DLLVM_NATIVE_ASMPARSER=LLVMInitializeX86AsmParser -DLLVM_NATIVE_ASMPRINTER=LLVMInitializeX86AsmPrinter -DLLVM_NATIVE_DISASSEMBLER=LLVMInitializeX86Disassembler -DLLVM_NATIVE_TARGET=LLVMInitializeX86Target -DLLVM_NATIVE_TARGETINFO=LLVMInitializeX86TargetInfo -DLLVM_NATIVE_TARGETMC=LLVMInitializeX86TargetMC -ffunction-sections -fdata-sections -g1 -MD -MF.depend.Core_DemangledNameInfo.pico -MTCore/DemangledNameInfo.pico -Wno-format-zero-length -fstack-protector-strong -Wdate-time -Wno-error=address -Wno-error=array-bounds -Wno-error=attributes -Wno-error=bool-compare -Wno-error=cast-align -Wno-error=clobbered -Wno-error=deprecated-declarations -Wno-error=enum-compare -Wno-error=extra -Wno-error=logical-not-parentheses -Wno-error=strict-aliasing -Wno-error=uninitialized -Wno-error=unused-function -Wno-error=unused-value -Wno-error=empty-body -Wno-error=maybe-uninitialized -Wno-error=nonnull-compare -Wno-error=shift-negative-value -Wno-error=tautological-compare -Wno-error=unused-const-variable -Wno-error=bool-operation -Wno-error=deprecated -Wno-error=expansion-to-defined -Wno-error=format-overflow -Wno-error=format-truncation -Wno-error=implicit-fallthrough -Wno-error=int-in-bool-context -Wno-error=memset-elt-size -Wno-error=noexcept-type -Wno-error=nonnull -Wno-error=pointer-compare -Wno-error=stringop-overflow -Wno-error=aggressive-loop-optimizations -Wno-error=cast-function-type -Wno-error=catch-value -Wno-error=multistatement-macros -Wno-error=restrict -Wno-error=sizeof-pointer-memaccess -Wno-error=stringop-truncation -Wno-return-type -Wno-address-of-packed-member -fno-strict-aliasing   -fno-exceptions -fno-rtti -fvisibility-inlines-hidden -g1 -std=c++17  -Wno-attributes -Wno-deprecated-declarations -Wno-error=class-memaccess -Wno-literal-suffix -Wno-c++20-extensions -Wno-attributes -Wno-error=unknown-pragmas -Wno-dangling-reference        -c /workspace/src/contrib/llvm-project/lldb/source/Core/DemangledNameInfo.cpp -o Core/DemangledNameInfo.pico
--- Core/DumpDataExtractor.pico ---
/usr/local/bin/x86_64-unknown-freebsd15.1-g++14  --sysroot=/tmp/obj/workspace/src/amd64.amd64/tmp -B/usr/local/x86_64-unknown-freebsd15.1/bin/ -fpic -DPIC  -UPIC -O2 -pipe -fno-common -I/workspace/src/contrib/llvm-project/lldb/include -I/workspace/src/contrib/llvm-project/lldb/source -I/tmp/obj/workspace/src/amd64.amd64/lib/clang/libllvm -I/tmp/obj/workspace/src/amd64.amd64/lib/clang/libclang -I/tmp/obj/workspace/src/amd64.amd64/lib/clang/liblldb -I/workspace/src/contrib/lua/src -I/workspace/src/lib/liblua -I/workspace/src/contrib/llvm-project/clang/include -DCLANG_ENABLE_STATIC_ANALYZER -I/workspace/src/lib/clang/include -I/workspace/src/contrib/llvm-project/llvm/include -D__STDC_CONSTANT_MACROS -D__STDC_FORMAT_MACROS -D__STDC_LIMIT_MACROS -DHAVE_VCS_VERSION_INC -DLLVM_DEFAULT_TARGET_TRIPLE=\"x86_64-unknown-freebsd16.0\" -DLLVM_HOST_TRIPLE=\"x86_64-unknown-freebsd16.0\" -DDEFAULT_SYSROOT=\"\" -DLLVM_TARGET_ENABLE_AARCH64 -DLLVM_TARGET_ENABLE_ARM -DLLVM_TARGET_ENABLE_POWERPC -DLLVM_TARGET_ENABLE_RISCV -DLLVM_TARGET_ENABLE_X86 -DLLVM_NATIVE_ASMPARSER=LLVMInitializeX86AsmParser -DLLVM_NATIVE_ASMPRINTER=LLVMInitializeX86AsmPrinter -DLLVM_NATIVE_DISASSEMBLER=LLVMInitializeX86Disassembler -DLLVM_NATIVE_TARGET=LLVMInitializeX86Target -DLLVM_NATIVE_TARGETINFO=LLVMInitializeX86TargetInfo -DLLVM_NATIVE_TARGETMC=LLVMInitializeX86TargetMC -ffunction-sections -fdata-sections -g1 -MD -MF.depend.Core_DumpDataExtractor.pico -MTCore/DumpDataExtractor.pico -Wno-format-zero-length -fstack-protector-strong -Wdate-time -Wno-error=address -Wno-error=array-bounds -Wno-error=attributes -Wno-error=bool-compare -Wno-error=cast-align -Wno-error=clobbered -Wno-error=deprecated-declarations -Wno-error=enum-compare -Wno-error=extra -Wno-error=logical-not-parentheses -Wno-error=strict-aliasing -Wno-error=uninitialized -Wno-error=unused-function -Wno-error=unused-value -Wno-error=empty-body -Wno-error=maybe-uninitialized -Wno-error=nonnull-compare -Wno-error=shift-negative-value -Wno-error=tautological-compare -Wno-error=unused-const-variable -Wno-error=bool-operation -Wno-error=deprecated -Wno-error=expansion-to-defined -Wno-error=format-overflow -Wno-error=format-truncation -Wno-error=implicit-fallthrough -Wno-error=int-in-bool-context -Wno-error=memset-elt-size -Wno-error=noexcept-type -Wno-error=nonnull -Wno-error=pointer-compare -Wno-error=stringop-overflow -Wno-error=aggressive-loop-optimizations -Wno-error=cast-function-type -Wno-error=catch-value -Wno-error=multistatement-macros -Wno-error=restrict -Wno-error=sizeof-pointer-memaccess -Wno-error=stringop-truncation -Wno-return-type -Wno-address-of-packed-member -fno-strict-aliasing   -fno-exceptions -fno-rtti -fvisibility-inlines-hidden -g1 -std=c++17  -Wno-attributes -Wno-deprecated-declarations -Wno-error=class-memaccess -Wno-literal-suffix -Wno-c++20-extensions -Wno-attributes -Wno-error=unknown-pragmas -Wno-dangling-reference        -c /workspace/src/contrib/llvm-project/lldb/source/Core/DumpDataExtractor.cpp -o Core/DumpDataExtractor.pico
--- Core/DumpRegisterInfo.pico ---
/usr/local/bin/x86_64-unknown-freebsd15.1-g++14  --sysroot=/tmp/obj/workspace/src/amd64.amd64/tmp -B/usr/local/x86_64-unknown-freebsd15.1/bin/ -fpic -DPIC  -UPIC -O2 -pipe -fno-common -I/workspace/src/contrib/llvm-project/lldb/include -I/workspace/src/contrib/llvm-project/lldb/source -I/tmp/obj/workspace/src/amd64.amd64/lib/clang/libllvm -I/tmp/obj/workspace/src/amd64.amd64/lib/clang/libclang -I/tmp/obj/workspace/src/amd64.amd64/lib/clang/liblldb -I/workspace/src/contrib/lua/src -I/workspace/src/lib/liblua -I/workspace/src/contrib/llvm-project/clang/include -DCLANG_ENABLE_STATIC_ANALYZER -I/workspace/src/lib/clang/include -I/workspace/src/contrib/llvm-project/llvm/include -D__STDC_CONSTANT_MACROS -D__STDC_FORMAT_MACROS -D__STDC_LIMIT_MACROS -DHAVE_VCS_VERSION_INC -DLLVM_DEFAULT_TARGET_TRIPLE=\"x86_64-unknown-freebsd16.0\" -DLLVM_HOST_TRIPLE=\"x86_64-unknown-freebsd16.0\" -DDEFAULT_SYSROOT=\"\" -DLLVM_TARGET_ENABLE_AARCH64 -DLLVM_TARGET_ENABLE_ARM -DLLVM_TARGET_ENABLE_POWERPC -DLLVM_TARGET_ENABLE_RISCV -DLLVM_TARGET_ENABLE_X86 -DLLVM_NATIVE_ASMPARSER=LLVMInitializeX86AsmParser -DLLVM_NATIVE_ASMPRINTER=LLVMInitializeX86AsmPrinter -DLLVM_NATIVE_DISASSEMBLER=LLVMInitializeX86Disassembler -DLLVM_NATIVE_TARGET=LLVMInitializeX86Target -DLLVM_NATIVE_TARGETINFO=LLVMInitializeX86TargetInfo -DLLVM_NATIVE_TARGETMC=LLVMInitializeX86TargetMC -ffunction-sections -fdata-sections -g1 -MD -MF.depend.Core_DumpRegisterInfo.pico -MTCore/DumpRegisterInfo.pico -Wno-format-zero-length -fstack-protector-strong -Wdate-time -Wno-error=address -Wno-error=array-bounds -Wno-error=attributes -Wno-error=bool-compare -Wno-error=cast-align -Wno-error=clobbered -Wno-error=deprecated-declarations -Wno-error=enum-compare -Wno-error=extra -Wno-error=logical-not-parentheses -Wno-error=strict-aliasing -Wno-error=uninitialized -Wno-error=unused-function -Wno-error=unused-value -Wno-error=empty-body -Wno-error=maybe-uninitialized -Wno-error=nonnull-compare -Wno-error=shift-negative-value -Wno-error=tautological-compare -Wno-error=unused-const-variable -Wno-error=bool-operation -Wno-error=deprecated -Wno-error=expansion-to-defined -Wno-error=format-overflow -Wno-error=format-truncation -Wno-error=implicit-fallthrough -Wno-error=int-in-bool-context -Wno-error=memset-elt-size -Wno-error=noexcept-type -Wno-error=nonnull -Wno-error=pointer-compare -Wno-error=stringop-overflow -Wno-error=aggressive-loop-optimizations -Wno-error=cast-function-type -Wno-error=catch-value -Wno-error=multistatement-macros -Wno-error=restrict -Wno-error=sizeof-pointer-memaccess -Wno-error=stringop-truncation -Wno-return-type -Wno-address-of-packed-member -fno-strict-aliasing   -fno-exceptions -fno-rtti -fvisibility-inlines-hidden -g1 -std=c++17  -Wno-attributes -Wno-deprecated-declarations -Wno-error=class-memaccess -Wno-literal-suffix -Wno-c++20-extensions -Wno-attributes -Wno-error=unknown-pragmas -Wno-dangling-reference        -c /workspace/src/contrib/llvm-project/lldb/source/Core/DumpRegisterInfo.cpp -o Core/DumpRegisterInfo.pico
--- Core/DumpRegisterValue.pico ---
/usr/local/bin/x86_64-unknown-freebsd15.1-g++14  --sysroot=/tmp/obj/workspace/src/amd64.amd64/tmp -B/usr/local/x86_64-unknown-freebsd15.1/bin/ -fpic -DPIC  -UPIC -O2 -pipe -fno-common -I/workspace/src/contrib/llvm-project/lldb/include -I/workspace/src/contrib/llvm-project/lldb/source -I/tmp/obj/workspace/src/amd64.amd64/lib/clang/libllvm -I/tmp/obj/workspace/src/amd64.amd64/lib/clang/libclang -I/tmp/obj/workspace/src/amd64.amd64/lib/clang/liblldb -I/workspace/src/contrib/lua/src -I/workspace/src/lib/liblua -I/workspace/src/contrib/llvm-project/clang/include -DCLANG_ENABLE_STATIC_ANALYZER -I/workspace/src/lib/clang/include -I/workspace/src/contrib/llvm-project/llvm/include -D__STDC_CONSTANT_MACROS -D__STDC_FORMAT_MACROS -D__STDC_LIMIT_MACROS -DHAVE_VCS_VERSION_INC -DLLVM_DEFAULT_TARGET_TRIPLE=\"x86_64-unknown-freebsd16.0\" -DLLVM_HOST_TRIPLE=\"x86_64-unknown-freebsd16.0\" -DDEFAULT_SYSROOT=\"\" -DLLVM_TARGET_ENABLE_AARCH64 -DLLVM_TARGET_ENABLE_ARM -DLLVM_TARGET_ENABLE_POWERPC -DLLVM_TARGET_ENABLE_RISCV -DLLVM_TARGET_ENABLE_X86 -DLLVM_NATIVE_ASMPARSER=LLVMInitializeX86AsmParser -DLLVM_NATIVE_ASMPRINTER=LLVMInitializeX86AsmPrinter -DLLVM_NATIVE_DISASSEMBLER=LLVMInitializeX86Disassembler -DLLVM_NATIVE_TARGET=LLVMInitializeX86Target -DLLVM_NATIVE_TARGETINFO=LLVMInitializeX86TargetInfo -DLLVM_NATIVE_TARGETMC=LLVMInitializeX86TargetMC -ffunction-sections -fdata-sections -g1 -MD -MF.depend.Core_DumpRegisterValue.pico -MTCore/DumpRegisterValue.pico -Wno-format-zero-length -fstack-protector-strong -Wdate-time -Wno-error=address -Wno-error=array-bounds -Wno-error=attributes -Wno-error=bool-compare -Wno-error=cast-align -Wno-error=clobbered -Wno-error=deprecated-declarations -Wno-error=enum-compare -Wno-error=extra -Wno-error=logical-not-parentheses -Wno-error=strict-aliasing -Wno-error=uninitialized -Wno-error=unused-function -Wno-error=unused-value -Wno-error=empty-body -Wno-error=maybe-uninitialized -Wno-error=nonnull-compare -Wno-error=shift-negative-value -Wno-error=tautological-compare -Wno-error=unused-const-variable -Wno-error=bool-operation -Wno-error=deprecated -Wno-error=expansion-to-defined -Wno-error=format-overflow -Wno-error=format-truncation -Wno-error=implicit-fallthrough -Wno-error=int-in-bool-context -Wno-error=memset-elt-size -Wno-error=noexcept-type -Wno-error=nonnull -Wno-error=pointer-compare -Wno-error=stringop-overflow -Wno-error=aggressive-loop-optimizations -Wno-error=cast-function-type -Wno-error=catch-value -Wno-error=multistatement-macros -Wno-error=restrict -Wno-error=sizeof-pointer-memaccess -Wno-error=stringop-truncation -Wno-return-type -Wno-address-of-packed-member -fno-strict-aliasing   -fno-exceptions -fno-rtti -fvisibility-inlines-hidden -g1 -std=c++17  -Wno-attributes -Wno-deprecated-declarations -Wno-error=class-memaccess -Wno-literal-suffix -Wno-c++20-extensions -Wno-attributes -Wno-error=unknown-pragmas -Wno-dangling-reference        -c /workspace/src/contrib/llvm-project/lldb/source/Core/DumpRegisterValue.cpp -o Core/DumpRegisterValue.pico
--- Core/DynamicLoader.pico ---
/usr/local/bin/x86_64-unknown-freebsd15.1-g++14  --sysroot=/tmp/obj/workspace/src/amd64.amd64/tmp -B/usr/local/x86_64-unknown-freebsd15.1/bin/ -fpic -DPIC  -UPIC -O2 -pipe -fno-common -I/workspace/src/contrib/llvm-project/lldb/include -I/workspace/src/contrib/llvm-project/lldb/source -I/tmp/obj/workspace/src/amd64.amd64/lib/clang/libllvm -I/tmp/obj/workspace/src/amd64.amd64/lib/clang/libclang -I/tmp/obj/workspace/src/amd64.amd64/lib/clang/liblldb -I/workspace/src/contrib/lua/src -I/workspace/src/lib/liblua -I/workspace/src/contrib/llvm-project/clang/include -DCLANG_ENABLE_STATIC_ANALYZER -I/workspace/src/lib/clang/include -I/workspace/src/contrib/llvm-project/llvm/include -D__STDC_CONSTANT_MACROS -D__STDC_FORMAT_MACROS -D__STDC_LIMIT_MACROS -DHAVE_VCS_VERSION_INC -DLLVM_DEFAULT_TARGET_TRIPLE=\"x86_64-unknown-freebsd16.0\" -DLLVM_HOST_TRIPLE=\"x86_64-unknown-freebsd16.0\" -DDEFAULT_SYSROOT=\"\" -DLLVM_TARGET_ENABLE_AARCH64 -DLLVM_TARGET_ENABLE_ARM -DLLVM_TARGET_ENABLE_POWERPC -DLLVM_TARGET_ENABLE_RISCV -DLLVM_TARGET_ENABLE_X86 -DLLVM_NATIVE_ASMPARSER=LLVMInitializeX86AsmParser -DLLVM_NATIVE_ASMPRINTER=LLVMInitializeX86AsmPrinter -DLLVM_NATIVE_DISASSEMBLER=LLVMInitializeX86Disassembler -DLLVM_NATIVE_TARGET=LLVMInitializeX86Target -DLLVM_NATIVE_TARGETINFO=LLVMInitializeX86TargetInfo -DLLVM_NATIVE_TARGETMC=LLVMInitializeX86TargetMC -ffunction-sections -fdata-sections -g1 -MD -MF.depend.Core_DynamicLoader.pico -MTCore/DynamicLoader.pico -Wno-format-zero-length -fstack-protector-strong -Wdate-time -Wno-error=address -Wno-error=array-bounds -Wno-error=attributes -Wno-error=bool-compare -Wno-error=cast-align -Wno-error=clobbered -Wno-error=deprecated-declarations -Wno-error=enum-compare -Wno-error=extra -Wno-error=logical-not-parentheses -Wno-error=strict-aliasing -Wno-error=uninitialized -Wno-error=unused-function -Wno-error=unused-value -Wno-error=empty-body -Wno-error=maybe-uninitialized -Wno-error=nonnull-compare -Wno-error=shift-negative-value -Wno-error=tautological-compare -Wno-error=unused-const-variable -Wno-error=bool-operation -Wno-error=deprecated -Wno-error=expansion-to-defined -Wno-error=format-overflow -Wno-error=format-truncation -Wno-error=implicit-fallthrough -Wno-error=int-in-bool-context -Wno-error=memset-elt-size -Wno-error=noexcept-type -Wno-error=nonnull -Wno-error=pointer-compare -Wno-error=stringop-overflow -Wno-error=aggressive-loop-optimizations -Wno-error=cast-function-type -Wno-error=catch-value -Wno-error=multistatement-macros -Wno-error=restrict -Wno-error=sizeof-pointer-memaccess -Wno-error=stringop-truncation -Wno-return-type -Wno-address-of-packed-member -fno-strict-aliasing   -fno-exceptions -fno-rtti -fvisibility-inlines-hidden -g1 -std=c++17  -Wno-attributes -Wno-deprecated-declarations -Wno-error=class-memaccess -Wno-literal-suffix -Wno-c++20-extensions -Wno-attributes -Wno-error=unknown-pragmas -Wno-dangling-reference        -c /workspace/src/contrib/llvm-project/lldb/source/Core/DynamicLoader.cpp -o Core/DynamicLoader.pico
--- Core/EmulateInstruction.pico ---
/usr/local/bin/x86_64-unknown-freebsd15.1-g++14  --sysroot=/tmp/obj/workspace/src/amd64.amd64/tmp -B/usr/local/x86_64-unknown-freebsd15.1/bin/ -fpic -DPIC  -UPIC -O2 -pipe -fno-common -I/workspace/src/contrib/llvm-project/lldb/include -I/workspace/src/contrib/llvm-project/lldb/source -I/tmp/obj/workspace/src/amd64.amd64/lib/clang/libllvm -I/tmp/obj/workspace/src/amd64.amd64/lib/clang/libclang -I/tmp/obj/workspace/src/amd64.amd64/lib/clang/liblldb -I/workspace/src/contrib/lua/src -I/workspace/src/lib/liblua -I/workspace/src/contrib/llvm-project/clang/include -DCLANG_ENABLE_STATIC_ANALYZER -I/workspace/src/lib/clang/include -I/workspace/src/contrib/llvm-project/llvm/include -D__STDC_CONSTANT_MACROS -D__STDC_FORMAT_MACROS -D__STDC_LIMIT_MACROS -DHAVE_VCS_VERSION_INC -DLLVM_DEFAULT_TARGET_TRIPLE=\"x86_64-unknown-freebsd16.0\" -DLLVM_HOST_TRIPLE=\"x86_64-unknown-freebsd16.0\" -DDEFAULT_SYSROOT=\"\" -DLLVM_TARGET_ENABLE_AARCH64 -DLLVM_TARGET_ENABLE_ARM -DLLVM_TARGET_ENABLE_POWERPC -DLLVM_TARGET_ENABLE_RISCV -DLLVM_TARGET_ENABLE_X86 -DLLVM_NATIVE_ASMPARSER=LLVMInitializeX86AsmParser -DLLVM_NATIVE_ASMPRINTER=LLVMInitializeX86AsmPrinter -DLLVM_NATIVE_DISASSEMBLER=LLVMInitializeX86Disassembler -DLLVM_NATIVE_TARGET=LLVMInitializeX86Target -DLLVM_NATIVE_TARGETINFO=LLVMInitializeX86TargetInfo -DLLVM_NATIVE_TARGETMC=LLVMInitializeX86TargetMC -ffunction-sections -fdata-sections -g1 -MD -MF.depend.Core_EmulateInstruction.pico -MTCore/EmulateInstruction.pico -Wno-format-zero-length -fstack-protector-strong -Wdate-time -Wno-error=address -Wno-error=array-bounds -Wno-error=attributes -Wno-error=bool-compare -Wno-error=cast-align -Wno-error=clobbered -Wno-error=deprecated-declarations -Wno-error=enum-compare -Wno-error=extra -Wno-error=logical-not-parentheses -Wno-error=strict-aliasing -Wno-error=uninitialized -Wno-error=unused-function -Wno-error=unused-value -Wno-error=empty-body -Wno-error=maybe-uninitialized -Wno-error=nonnull-compare -Wno-error=shift-negative-value -Wno-error=tautological-compare -Wno-error=unused-const-variable -Wno-error=bool-operation -Wno-error=deprecated -Wno-error=expansion-to-defined -Wno-error=format-overflow -Wno-error=format-truncation -Wno-error=implicit-fallthrough -Wno-error=int-in-bool-context -Wno-error=memset-elt-size -Wno-error=noexcept-type -Wno-error=nonnull -Wno-error=pointer-compare -Wno-error=stringop-overflow -Wno-error=aggressive-loop-optimizations -Wno-error=cast-function-type -Wno-error=catch-value -Wno-error=multistatement-macros -Wno-error=restrict -Wno-error=sizeof-pointer-memaccess -Wno-error=stringop-truncation -Wno-return-type -Wno-address-of-packed-member -fno-strict-aliasing   -fno-exceptions -fno-rtti -fvisibility-inlines-hidden -g1 -std=c++17  -Wno-attributes -Wno-deprecated-declarations -Wno-error=class-memaccess -Wno-literal-suffix -Wno-c++20-extensions -Wno-attributes -Wno-error=unknown-pragmas -Wno-dangling-reference        -c /workspace/src/contrib/llvm-project/lldb/source/Core/EmulateInstruction.cpp -o Core/EmulateInstruction.pico
--- Core/FileLineResolver.pico ---
/usr/local/bin/x86_64-unknown-freebsd15.1-g++14  --sysroot=/tmp/obj/workspace/src/amd64.amd64/tmp -B/usr/local/x86_64-unknown-freebsd15.1/bin/ -fpic -DPIC  -UPIC -O2 -pipe -fno-common -I/workspace/src/contrib/llvm-project/lldb/include -I/workspace/src/contrib/llvm-project/lldb/source -I/tmp/obj/workspace/src/amd64.amd64/lib/clang/libllvm -I/tmp/obj/workspace/src/amd64.amd64/lib/clang/libclang -I/tmp/obj/workspace/src/amd64.amd64/lib/clang/liblldb -I/workspace/src/contrib/lua/src -I/workspace/src/lib/liblua -I/workspace/src/contrib/llvm-project/clang/include -DCLANG_ENABLE_STATIC_ANALYZER -I/workspace/src/lib/clang/include -I/workspace/src/contrib/llvm-project/llvm/include -D__STDC_CONSTANT_MACROS -D__STDC_FORMAT_MACROS -D__STDC_LIMIT_MACROS -DHAVE_VCS_VERSION_INC -DLLVM_DEFAULT_TARGET_TRIPLE=\"x86_64-unknown-freebsd16.0\" -DLLVM_HOST_TRIPLE=\"x86_64-unknown-freebsd16.0\" -DDEFAULT_SYSROOT=\"\" -DLLVM_TARGET_ENABLE_AARCH64 -DLLVM_TARGET_ENABLE_ARM -DLLVM_TARGET_ENABLE_POWERPC -DLLVM_TARGET_ENABLE_RISCV -DLLVM_TARGET_ENABLE_X86 -DLLVM_NATIVE_ASMPARSER=LLVMInitializeX86AsmParser -DLLVM_NATIVE_ASMPRINTER=LLVMInitializeX86AsmPrinter -DLLVM_NATIVE_DISASSEMBLER=LLVMInitializeX86Disassembler -DLLVM_NATIVE_TARGET=LLVMInitializeX86Target -DLLVM_NATIVE_TARGETINFO=LLVMInitializeX86TargetInfo -DLLVM_NATIVE_TARGETMC=LLVMInitializeX86TargetMC -ffunction-sections -fdata-sections -g1 -MD -MF.depend.Core_FileLineResolver.pico -MTCore/FileLineResolver.pico -Wno-format-zero-length -fstack-protector-strong -Wdate-time -Wno-error=address -Wno-error=array-bounds -Wno-error=attributes -Wno-error=bool-compare -Wno-error=cast-align -Wno-error=clobbered -Wno-error=deprecated-declarations -Wno-error=enum-compare -Wno-error=extra -Wno-error=logical-not-parentheses -Wno-error=strict-aliasing -Wno-error=uninitialized -Wno-error=unused-function -Wno-error=unused-value -Wno-error=empty-body -Wno-error=maybe-uninitialized -Wno-error=nonnull-compare -Wno-error=shift-negative-value -Wno-error=tautological-compare -Wno-error=unused-const-variable -Wno-error=bool-operation -Wno-error=deprecated -Wno-error=expansion-to-defined -Wno-error=format-overflow -Wno-error=format-truncation -Wno-error=implicit-fallthrough -Wno-error=int-in-bool-context -Wno-error=memset-elt-size -Wno-error=noexcept-type -Wno-error=nonnull -Wno-error=pointer-compare -Wno-error=stringop-overflow -Wno-error=aggressive-loop-optimizations -Wno-error=cast-function-type -Wno-error=catch-value -Wno-error=multistatement-macros -Wno-error=restrict -Wno-error=sizeof-pointer-memaccess -Wno-error=stringop-truncation -Wno-return-type -Wno-address-of-packed-member -fno-strict-aliasing   -fno-exceptions -fno-rtti -fvisibility-inlines-hidden -g1 -std=c++17  -Wno-attributes -Wno-deprecated-declarations -Wno-error=class-memaccess -Wno-literal-suffix -Wno-c++20-extensions -Wno-attributes -Wno-error=unknown-pragmas -Wno-dangling-reference        -c /workspace/src/contrib/llvm-project/lldb/source/Core/FileLineResolver.cpp -o Core/FileLineResolver.pico
--- Core/FormatEntity.pico ---
/usr/local/bin/x86_64-unknown-freebsd15.1-g++14  --sysroot=/tmp/obj/workspace/src/amd64.amd64/tmp -B/usr/local/x86_64-unknown-freebsd15.1/bin/ -fpic -DPIC  -UPIC -O2 -pipe -fno-common -I/workspace/src/contrib/llvm-project/lldb/include -I/workspace/src/contrib/llvm-project/lldb/source -I/tmp/obj/workspace/src/amd64.amd64/lib/clang/libllvm -I/tmp/obj/workspace/src/amd64.amd64/lib/clang/libclang -I/tmp/obj/workspace/src/amd64.amd64/lib/clang/liblldb -I/workspace/src/contrib/lua/src -I/workspace/src/lib/liblua -I/workspace/src/contrib/llvm-project/clang/include -DCLANG_ENABLE_STATIC_ANALYZER -I/workspace/src/lib/clang/include -I/workspace/src/contrib/llvm-project/llvm/include -D__STDC_CONSTANT_MACROS -D__STDC_FORMAT_MACROS -D__STDC_LIMIT_MACROS -DHAVE_VCS_VERSION_INC -DLLVM_DEFAULT_TARGET_TRIPLE=\"x86_64-unknown-freebsd16.0\" -DLLVM_HOST_TRIPLE=\"x86_64-unknown-freebsd16.0\" -DDEFAULT_SYSROOT=\"\" -DLLVM_TARGET_ENABLE_AARCH64 -DLLVM_TARGET_ENABLE_ARM -DLLVM_TARGET_ENABLE_POWERPC -DLLVM_TARGET_ENABLE_RISCV -DLLVM_TARGET_ENABLE_X86 -DLLVM_NATIVE_ASMPARSER=LLVMInitializeX86AsmParser -DLLVM_NATIVE_ASMPRINTER=LLVMInitializeX86AsmPrinter -DLLVM_NATIVE_DISASSEMBLER=LLVMInitializeX86Disassembler -DLLVM_NATIVE_TARGET=LLVMInitializeX86Target -DLLVM_NATIVE_TARGETINFO=LLVMInitializeX86TargetInfo -DLLVM_NATIVE_TARGETMC=LLVMInitializeX86TargetMC -ffunction-sections -fdata-sections -g1 -MD -MF.depend.Core_FormatEntity.pico -MTCore/FormatEntity.pico -Wno-format-zero-length -fstack-protector-strong -Wdate-time -Wno-error=address -Wno-error=array-bounds -Wno-error=attributes -Wno-error=bool-compare -Wno-error=cast-align -Wno-error=clobbered -Wno-error=deprecated-declarations -Wno-error=enum-compare -Wno-error=extra -Wno-error=logical-not-parentheses -Wno-error=strict-aliasing -Wno-error=uninitialized -Wno-error=unused-function -Wno-error=unused-value -Wno-error=empty-body -Wno-error=maybe-uninitialized -Wno-error=nonnull-compare -Wno-error=shift-negative-value -Wno-error=tautological-compare -Wno-error=unused-const-variable -Wno-error=bool-operation -Wno-error=deprecated -Wno-error=expansion-to-defined -Wno-error=format-overflow -Wno-error=format-truncation -Wno-error=implicit-fallthrough -Wno-error=int-in-bool-context -Wno-error=memset-elt-size -Wno-error=noexcept-type -Wno-error=nonnull -Wno-error=pointer-compare -Wno-error=stringop-overflow -Wno-error=aggressive-loop-optimizations -Wno-error=cast-function-type -Wno-error=catch-value -Wno-error=multistatement-macros -Wno-error=restrict -Wno-error=sizeof-pointer-memaccess -Wno-error=stringop-truncation -Wno-return-type -Wno-address-of-packed-member -fno-strict-aliasing   -fno-exceptions -fno-rtti -fvisibility-inlines-hidden -g1 -std=c++17  -Wno-attributes -Wno-deprecated-declarations -Wno-error=class-memaccess -Wno-literal-suffix -Wno-c++20-extensions -Wno-attributes -Wno-error=unknown-pragmas -Wno-dangling-reference        -c /workspace/src/contrib/llvm-project/lldb/source/Core/FormatEntity.cpp -o Core/FormatEntity.pico
--- Core/Highlighter.pico ---
/usr/local/bin/x86_64-unknown-freebsd15.1-g++14  --sysroot=/tmp/obj/workspace/src/amd64.amd64/tmp -B/usr/local/x86_64-unknown-freebsd15.1/bin/ -fpic -DPIC  -UPIC -O2 -pipe -fno-common -I/workspace/src/contrib/llvm-project/lldb/include -I/workspace/src/contrib/llvm-project/lldb/source -I/tmp/obj/workspace/src/amd64.amd64/lib/clang/libllvm -I/tmp/obj/workspace/src/amd64.amd64/lib/clang/libclang -I/tmp/obj/workspace/src/amd64.amd64/lib/clang/liblldb -I/workspace/src/contrib/lua/src -I/workspace/src/lib/liblua -I/workspace/src/contrib/llvm-project/clang/include -DCLANG_ENABLE_STATIC_ANALYZER -I/workspace/src/lib/clang/include -I/workspace/src/contrib/llvm-project/llvm/include -D__STDC_CONSTANT_MACROS -D__STDC_FORMAT_MACROS -D__STDC_LIMIT_MACROS -DHAVE_VCS_VERSION_INC -DLLVM_DEFAULT_TARGET_TRIPLE=\"x86_64-unknown-freebsd16.0\" -DLLVM_HOST_TRIPLE=\"x86_64-unknown-freebsd16.0\" -DDEFAULT_SYSROOT=\"\" -DLLVM_TARGET_ENABLE_AARCH64 -DLLVM_TARGET_ENABLE_ARM -DLLVM_TARGET_ENABLE_POWERPC -DLLVM_TARGET_ENABLE_RISCV -DLLVM_TARGET_ENABLE_X86 -DLLVM_NATIVE_ASMPARSER=LLVMInitializeX86AsmParser -DLLVM_NATIVE_ASMPRINTER=LLVMInitializeX86AsmPrinter -DLLVM_NATIVE_DISASSEMBLER=LLVMInitializeX86Disassembler -DLLVM_NATIVE_TARGET=LLVMInitializeX86Target -DLLVM_NATIVE_TARGETINFO=LLVMInitializeX86TargetInfo -DLLVM_NATIVE_TARGETMC=LLVMInitializeX86TargetMC -ffunction-sections -fdata-sections -g1 -MD -MF.depend.Core_Highlighter.pico -MTCore/Highlighter.pico -Wno-format-zero-length -fstack-protector-strong -Wdate-time -Wno-error=address -Wno-error=array-bounds -Wno-error=attributes -Wno-error=bool-compare -Wno-error=cast-align -Wno-error=clobbered -Wno-error=deprecated-declarations -Wno-error=enum-compare -Wno-error=extra -Wno-error=logical-not-parentheses -Wno-error=strict-aliasing -Wno-error=uninitialized -Wno-error=unused-function -Wno-error=unused-value -Wno-error=empty-body -Wno-error=maybe-uninitialized -Wno-error=nonnull-compare -Wno-error=shift-negative-value -Wno-error=tautological-compare -Wno-error=unused-const-variable -Wno-error=bool-operation -Wno-error=deprecated -Wno-error=expansion-to-defined -Wno-error=format-overflow -Wno-error=format-truncation -Wno-error=implicit-fallthrough -Wno-error=int-in-bool-context -Wno-error=memset-elt-size -Wno-error=noexcept-type -Wno-error=nonnull -Wno-error=pointer-compare -Wno-error=stringop-overflow -Wno-error=aggressive-loop-optimizations -Wno-error=cast-function-type -Wno-error=catch-value -Wno-error=multistatement-macros -Wno-error=restrict -Wno-error=sizeof-pointer-memaccess -Wno-error=stringop-truncation -Wno-return-type -Wno-address-of-packed-member -fno-strict-aliasing   -fno-exceptions -fno-rtti -fvisibility-inlines-hidden -g1 -std=c++17  -Wno-attributes -Wno-deprecated-declarations -Wno-error=class-memaccess -Wno-literal-suffix -Wno-c++20-extensions -Wno-attributes -Wno-error=unknown-pragmas -Wno-dangling-reference        -c /workspace/src/contrib/llvm-project/lldb/source/Core/Highlighter.cpp -o Core/Highlighter.pico
--- Core/IOHandler.pico ---
/usr/local/bin/x86_64-unknown-freebsd15.1-g++14  --sysroot=/tmp/obj/workspace/src/amd64.amd64/tmp -B/usr/local/x86_64-unknown-freebsd15.1/bin/ -fpic -DPIC  -UPIC -O2 -pipe -fno-common -I/workspace/src/contrib/llvm-project/lldb/include -I/workspace/src/contrib/llvm-project/lldb/source -I/tmp/obj/workspace/src/amd64.amd64/lib/clang/libllvm -I/tmp/obj/workspace/src/amd64.amd64/lib/clang/libclang -I/tmp/obj/workspace/src/amd64.amd64/lib/clang/liblldb -I/workspace/src/contrib/lua/src -I/workspace/src/lib/liblua -I/workspace/src/contrib/llvm-project/clang/include -DCLANG_ENABLE_STATIC_ANALYZER -I/workspace/src/lib/clang/include -I/workspace/src/contrib/llvm-project/llvm/include -D__STDC_CONSTANT_MACROS -D__STDC_FORMAT_MACROS -D__STDC_LIMIT_MACROS -DHAVE_VCS_VERSION_INC -DLLVM_DEFAULT_TARGET_TRIPLE=\"x86_64-unknown-freebsd16.0\" -DLLVM_HOST_TRIPLE=\"x86_64-unknown-freebsd16.0\" -DDEFAULT_SYSROOT=\"\" -DLLVM_TARGET_ENABLE_AARCH64 -DLLVM_TARGET_ENABLE_ARM -DLLVM_TARGET_ENABLE_POWERPC -DLLVM_TARGET_ENABLE_RISCV -DLLVM_TARGET_ENABLE_X86 -DLLVM_NATIVE_ASMPARSER=LLVMInitializeX86AsmParser -DLLVM_NATIVE_ASMPRINTER=LLVMInitializeX86AsmPrinter -DLLVM_NATIVE_DISASSEMBLER=LLVMInitializeX86Disassembler -DLLVM_NATIVE_TARGET=LLVMInitializeX86Target -DLLVM_NATIVE_TARGETINFO=LLVMInitializeX86TargetInfo -DLLVM_NATIVE_TARGETMC=LLVMInitializeX86TargetMC -ffunction-sections -fdata-sections -g1 -MD -MF.depend.Core_IOHandler.pico -MTCore/IOHandler.pico -Wno-format-zero-length -fstack-protector-strong -Wdate-time -Wno-error=address -Wno-error=array-bounds -Wno-error=attributes -Wno-error=bool-compare -Wno-error=cast-align -Wno-error=clobbered -Wno-error=deprecated-declarations -Wno-error=enum-compare -Wno-error=extra -Wno-error=logical-not-parentheses -Wno-error=strict-aliasing -Wno-error=uninitialized -Wno-error=unused-function -Wno-error=unused-value -Wno-error=empty-body -Wno-error=maybe-uninitialized -Wno-error=nonnull-compare -Wno-error=shift-negative-value -Wno-error=tautological-compare -Wno-error=unused-const-variable -Wno-error=bool-operation -Wno-error=deprecated -Wno-error=expansion-to-defined -Wno-error=format-overflow -Wno-error=format-truncation -Wno-error=implicit-fallthrough -Wno-error=int-in-bool-context -Wno-error=memset-elt-size -Wno-error=noexcept-type -Wno-error=nonnull -Wno-error=pointer-compare -Wno-error=stringop-overflow -Wno-error=aggressive-loop-optimizations -Wno-error=cast-function-type -Wno-error=catch-value -Wno-error=multistatement-macros -Wno-error=restrict -Wno-error=sizeof-pointer-memaccess -Wno-error=stringop-truncation -Wno-return-type -Wno-address-of-packed-member -fno-strict-aliasing   -fno-exceptions -fno-rtti -fvisibility-inlines-hidden -g1 -std=c++17  -Wno-attributes -Wno-deprecated-declarations -Wno-error=class-memaccess -Wno-literal-suffix -Wno-c++20-extensions -Wno-attributes -Wno-error=unknown-pragmas -Wno-dangling-reference        -c /workspace/src/contrib/llvm-project/lldb/source/Core/IOHandler.cpp -o Core/IOHandler.pico
--- Core/IOHandlerCursesGUI.pico ---
/usr/local/bin/x86_64-unknown-freebsd15.1-g++14  --sysroot=/tmp/obj/workspace/src/amd64.amd64/tmp -B/usr/local/x86_64-unknown-freebsd15.1/bin/ -fpic -DPIC  -UPIC -O2 -pipe -fno-common -I/workspace/src/contrib/llvm-project/lldb/include -I/workspace/src/contrib/llvm-project/lldb/source -I/tmp/obj/workspace/src/amd64.amd64/lib/clang/libllvm -I/tmp/obj/workspace/src/amd64.amd64/lib/clang/libclang -I/tmp/obj/workspace/src/amd64.amd64/lib/clang/liblldb -I/workspace/src/contrib/lua/src -I/workspace/src/lib/liblua -I/workspace/src/contrib/llvm-project/clang/include -DCLANG_ENABLE_STATIC_ANALYZER -I/workspace/src/lib/clang/include -I/workspace/src/contrib/llvm-project/llvm/include -D__STDC_CONSTANT_MACROS -D__STDC_FORMAT_MACROS -D__STDC_LIMIT_MACROS -DHAVE_VCS_VERSION_INC -DLLVM_DEFAULT_TARGET_TRIPLE=\"x86_64-unknown-freebsd16.0\" -DLLVM_HOST_TRIPLE=\"x86_64-unknown-freebsd16.0\" -DDEFAULT_SYSROOT=\"\" -DLLVM_TARGET_ENABLE_AARCH64 -DLLVM_TARGET_ENABLE_ARM -DLLVM_TARGET_ENABLE_POWERPC -DLLVM_TARGET_ENABLE_RISCV -DLLVM_TARGET_ENABLE_X86 -DLLVM_NATIVE_ASMPARSER=LLVMInitializeX86AsmParser -DLLVM_NATIVE_ASMPRINTER=LLVMInitializeX86AsmPrinter -DLLVM_NATIVE_DISASSEMBLER=LLVMInitializeX86Disassembler -DLLVM_NATIVE_TARGET=LLVMInitializeX86Target -DLLVM_NATIVE_TARGETINFO=LLVMInitializeX86TargetInfo -DLLVM_NATIVE_TARGETMC=LLVMInitializeX86TargetMC -ffunction-sections -fdata-sections -g1 -MD -MF.depend.Core_IOHandlerCursesGUI.pico -MTCore/IOHandlerCursesGUI.pico -Wno-format-zero-length -fstack-protector-strong -Wdate-time -Wno-error=address -Wno-error=array-bounds -Wno-error=attributes -Wno-error=bool-compare -Wno-error=cast-align -Wno-error=clobbered -Wno-error=deprecated-declarations -Wno-error=enum-compare -Wno-error=extra -Wno-error=logical-not-parentheses -Wno-error=strict-aliasing -Wno-error=uninitialized -Wno-error=unused-function -Wno-error=unused-value -Wno-error=empty-body -Wno-error=maybe-uninitialized -Wno-error=nonnull-compare -Wno-error=shift-negative-value -Wno-error=tautological-compare -Wno-error=unused-const-variable -Wno-error=bool-operation -Wno-error=deprecated -Wno-error=expansion-to-defined -Wno-error=format-overflow -Wno-error=format-truncation -Wno-error=implicit-fallthrough -Wno-error=int-in-bool-context -Wno-error=memset-elt-size -Wno-error=noexcept-type -Wno-error=nonnull -Wno-error=pointer-compare -Wno-error=stringop-overflow -Wno-error=aggressive-loop-optimizations -Wno-error=cast-function-type -Wno-error=catch-value -Wno-error=multistatement-macros -Wno-error=restrict -Wno-error=sizeof-pointer-memaccess -Wno-error=stringop-truncation -Wno-return-type -Wno-address-of-packed-member -fno-strict-aliasing   -fno-exceptions -fno-rtti -fvisibility-inlines-hidden -g1 -std=c++17  -Wno-attributes -Wno-deprecated-declarations -Wno-error=class-memaccess -Wno-literal-suffix -Wno-c++20-extensions -Wno-attributes -Wno-error=unknown-pragmas -Wno-dangling-reference        -c /workspace/src/contrib/llvm-project/lldb/source/Core/IOHandlerCursesGUI.cpp -o Core/IOHandlerCursesGUI.pico
--- Core/Mangled.pico ---
/usr/local/bin/x86_64-unknown-freebsd15.1-g++14  --sysroot=/tmp/obj/workspace/src/amd64.amd64/tmp -B/usr/local/x86_64-unknown-freebsd15.1/bin/ -fpic -DPIC  -UPIC -O2 -pipe -fno-common -I/workspace/src/contrib/llvm-project/lldb/include -I/workspace/src/contrib/llvm-project/lldb/source -I/tmp/obj/workspace/src/amd64.amd64/lib/clang/libllvm -I/tmp/obj/workspace/src/amd64.amd64/lib/clang/libclang -I/tmp/obj/workspace/src/amd64.amd64/lib/clang/liblldb -I/workspace/src/contrib/lua/src -I/workspace/src/lib/liblua -I/workspace/src/contrib/llvm-project/clang/include -DCLANG_ENABLE_STATIC_ANALYZER -I/workspace/src/lib/clang/include -I/workspace/src/contrib/llvm-project/llvm/include -D__STDC_CONSTANT_MACROS -D__STDC_FORMAT_MACROS -D__STDC_LIMIT_MACROS -DHAVE_VCS_VERSION_INC -DLLVM_DEFAULT_TARGET_TRIPLE=\"x86_64-unknown-freebsd16.0\" -DLLVM_HOST_TRIPLE=\"x86_64-unknown-freebsd16.0\" -DDEFAULT_SYSROOT=\"\" -DLLVM_TARGET_ENABLE_AARCH64 -DLLVM_TARGET_ENABLE_ARM -DLLVM_TARGET_ENABLE_POWERPC -DLLVM_TARGET_ENABLE_RISCV -DLLVM_TARGET_ENABLE_X86 -DLLVM_NATIVE_ASMPARSER=LLVMInitializeX86AsmParser -DLLVM_NATIVE_ASMPRINTER=LLVMInitializeX86AsmPrinter -DLLVM_NATIVE_DISASSEMBLER=LLVMInitializeX86Disassembler -DLLVM_NATIVE_TARGET=LLVMInitializeX86Target -DLLVM_NATIVE_TARGETINFO=LLVMInitializeX86TargetInfo -DLLVM_NATIVE_TARGETMC=LLVMInitializeX86TargetMC -ffunction-sections -fdata-sections -g1 -MD -MF.depend.Core_Mangled.pico -MTCore/Mangled.pico -Wno-format-zero-length -fstack-protector-strong -Wdate-time -Wno-error=address -Wno-error=array-bounds -Wno-error=attributes -Wno-error=bool-compare -Wno-error=cast-align -Wno-error=clobbered -Wno-error=deprecated-declarations -Wno-error=enum-compare -Wno-error=extra -Wno-error=logical-not-parentheses -Wno-error=strict-aliasing -Wno-error=uninitialized -Wno-error=unused-function -Wno-error=unused-value -Wno-error=empty-body -Wno-error=maybe-uninitialized -Wno-error=nonnull-compare -Wno-error=shift-negative-value -Wno-error=tautological-compare -Wno-error=unused-const-variable -Wno-error=bool-operation -Wno-error=deprecated -Wno-error=expansion-to-defined -Wno-error=format-overflow -Wno-error=format-truncation -Wno-error=implicit-fallthrough -Wno-error=int-in-bool-context -Wno-error=memset-elt-size -Wno-error=noexcept-type -Wno-error=nonnull -Wno-error=pointer-compare -Wno-error=stringop-overflow -Wno-error=aggressive-loop-optimizations -Wno-error=cast-function-type -Wno-error=catch-value -Wno-error=multistatement-macros -Wno-error=restrict -Wno-error=sizeof-pointer-memaccess -Wno-error=stringop-truncation -Wno-return-type -Wno-address-of-packed-member -fno-strict-aliasing   -fno-exceptions -fno-rtti -fvisibility-inlines-hidden -g1 -std=c++17  -Wno-attributes -Wno-deprecated-declarations -Wno-error=class-memaccess -Wno-literal-suffix -Wno-c++20-extensions -Wno-attributes -Wno-error=unknown-pragmas -Wno-dangling-reference        -c /workspace/src/contrib/llvm-project/lldb/source/Core/Mangled.cpp -o Core/Mangled.pico
--- Core/Module.pico ---
/usr/local/bin/x86_64-unknown-freebsd15.1-g++14  --sysroot=/tmp/obj/workspace/src/amd64.amd64/tmp -B/usr/local/x86_64-unknown-freebsd15.1/bin/ -fpic -DPIC  -UPIC -O2 -pipe -fno-common -I/workspace/src/contrib/llvm-project/lldb/include -I/workspace/src/contrib/llvm-project/lldb/source -I/tmp/obj/workspace/src/amd64.amd64/lib/clang/libllvm -I/tmp/obj/workspace/src/amd64.amd64/lib/clang/libclang -I/tmp/obj/workspace/src/amd64.amd64/lib/clang/liblldb -I/workspace/src/contrib/lua/src -I/workspace/src/lib/liblua -I/workspace/src/contrib/llvm-project/clang/include -DCLANG_ENABLE_STATIC_ANALYZER -I/workspace/src/lib/clang/include -I/workspace/src/contrib/llvm-project/llvm/include -D__STDC_CONSTANT_MACROS -D__STDC_FORMAT_MACROS -D__STDC_LIMIT_MACROS -DHAVE_VCS_VERSION_INC -DLLVM_DEFAULT_TARGET_TRIPLE=\"x86_64-unknown-freebsd16.0\" -DLLVM_HOST_TRIPLE=\"x86_64-unknown-freebsd16.0\" -DDEFAULT_SYSROOT=\"\" -DLLVM_TARGET_ENABLE_AARCH64 -DLLVM_TARGET_ENABLE_ARM -DLLVM_TARGET_ENABLE_POWERPC -DLLVM_TARGET_ENABLE_RISCV -DLLVM_TARGET_ENABLE_X86 -DLLVM_NATIVE_ASMPARSER=LLVMInitializeX86AsmParser -DLLVM_NATIVE_ASMPRINTER=LLVMInitializeX86AsmPrinter -DLLVM_NATIVE_DISASSEMBLER=LLVMInitializeX86Disassembler -DLLVM_NATIVE_TARGET=LLVMInitializeX86Target -DLLVM_NATIVE_TARGETINFO=LLVMInitializeX86TargetInfo -DLLVM_NATIVE_TARGETMC=LLVMInitializeX86TargetMC -ffunction-sections -fdata-sections -g1 -MD -MF.depend.Core_Module.pico -MTCore/Module.pico -Wno-format-zero-length -fstack-protector-strong -Wdate-time -Wno-error=address -Wno-error=array-bounds -Wno-error=attributes -Wno-error=bool-compare -Wno-error=cast-align -Wno-error=clobbered -Wno-error=deprecated-declarations -Wno-error=enum-compare -Wno-error=extra -Wno-error=logical-not-parentheses -Wno-error=strict-aliasing -Wno-error=uninitialized -Wno-error=unused-function -Wno-error=unused-value -Wno-error=empty-body -Wno-error=maybe-uninitialized -Wno-error=nonnull-compare -Wno-error=shift-negative-value -Wno-error=tautological-compare -Wno-error=unused-const-variable -Wno-error=bool-operation -Wno-error=deprecated -Wno-error=expansion-to-defined -Wno-error=format-overflow -Wno-error=format-truncation -Wno-error=implicit-fallthrough -Wno-error=int-in-bool-context -Wno-error=memset-elt-size -Wno-error=noexcept-type -Wno-error=nonnull -Wno-error=pointer-compare -Wno-error=stringop-overflow -Wno-error=aggressive-loop-optimizations -Wno-error=cast-function-type -Wno-error=catch-value -Wno-error=multistatement-macros -Wno-error=restrict -Wno-error=sizeof-pointer-memaccess -Wno-error=stringop-truncation -Wno-return-type -Wno-address-of-packed-member -fno-strict-aliasing   -fno-exceptions -fno-rtti -fvisibility-inlines-hidden -g1 -std=c++17  -Wno-attributes -Wno-deprecated-declarations -Wno-error=class-memaccess -Wno-literal-suffix -Wno-c++20-extensions -Wno-attributes -Wno-error=unknown-pragmas -Wno-dangling-reference        -c /workspace/src/contrib/llvm-project/lldb/source/Core/Module.cpp -o Core/Module.pico
--- Core/ModuleChild.pico ---
/usr/local/bin/x86_64-unknown-freebsd15.1-g++14  --sysroot=/tmp/obj/workspace/src/amd64.amd64/tmp -B/usr/local/x86_64-unknown-freebsd15.1/bin/ -fpic -DPIC  -UPIC -O2 -pipe -fno-common -I/workspace/src/contrib/llvm-project/lldb/include -I/workspace/src/contrib/llvm-project/lldb/source -I/tmp/obj/workspace/src/amd64.amd64/lib/clang/libllvm -I/tmp/obj/workspace/src/amd64.amd64/lib/clang/libclang -I/tmp/obj/workspace/src/amd64.amd64/lib/clang/liblldb -I/workspace/src/contrib/lua/src -I/workspace/src/lib/liblua -I/workspace/src/contrib/llvm-project/clang/include -DCLANG_ENABLE_STATIC_ANALYZER -I/workspace/src/lib/clang/include -I/workspace/src/contrib/llvm-project/llvm/include -D__STDC_CONSTANT_MACROS -D__STDC_FORMAT_MACROS -D__STDC_LIMIT_MACROS -DHAVE_VCS_VERSION_INC -DLLVM_DEFAULT_TARGET_TRIPLE=\"x86_64-unknown-freebsd16.0\" -DLLVM_HOST_TRIPLE=\"x86_64-unknown-freebsd16.0\" -DDEFAULT_SYSROOT=\"\" -DLLVM_TARGET_ENABLE_AARCH64 -DLLVM_TARGET_ENABLE_ARM -DLLVM_TARGET_ENABLE_POWERPC -DLLVM_TARGET_ENABLE_RISCV -DLLVM_TARGET_ENABLE_X86 -DLLVM_NATIVE_ASMPARSER=LLVMInitializeX86AsmParser -DLLVM_NATIVE_ASMPRINTER=LLVMInitializeX86AsmPrinter -DLLVM_NATIVE_DISASSEMBLER=LLVMInitializeX86Disassembler -DLLVM_NATIVE_TARGET=LLVMInitializeX86Target -DLLVM_NATIVE_TARGETINFO=LLVMInitializeX86TargetInfo -DLLVM_NATIVE_TARGETMC=LLVMInitializeX86TargetMC -ffunction-sections -fdata-sections -g1 -MD -MF.depend.Core_ModuleChild.pico -MTCore/ModuleChild.pico -Wno-format-zero-length -fstack-protector-strong -Wdate-time -Wno-error=address -Wno-error=array-bounds -Wno-error=attributes -Wno-error=bool-compare -Wno-error=cast-align -Wno-error=clobbered -Wno-error=deprecated-declarations -Wno-error=enum-compare -Wno-error=extra -Wno-error=logical-not-parentheses -Wno-error=strict-aliasing -Wno-error=uninitialized -Wno-error=unused-function -Wno-error=unused-value -Wno-error=empty-body -Wno-error=maybe-uninitialized -Wno-error=nonnull-compare -Wno-error=shift-negative-value -Wno-error=tautological-compare -Wno-error=unused-const-variable -Wno-error=bool-operation -Wno-error=deprecated -Wno-error=expansion-to-defined -Wno-error=format-overflow -Wno-error=format-truncation -Wno-error=implicit-fallthrough -Wno-error=int-in-bool-context -Wno-error=memset-elt-size -Wno-error=noexcept-type -Wno-error=nonnull -Wno-error=pointer-compare -Wno-error=stringop-overflow -Wno-error=aggressive-loop-optimizations -Wno-error=cast-function-type -Wno-error=catch-value -Wno-error=multistatement-macros -Wno-error=restrict -Wno-error=sizeof-pointer-memaccess -Wno-error=stringop-truncation -Wno-return-type -Wno-address-of-packed-member -fno-strict-aliasing   -fno-exceptions -fno-rtti -fvisibility-inlines-hidden -g1 -std=c++17  -Wno-attributes -Wno-deprecated-declarations -Wno-error=class-memaccess -Wno-literal-suffix -Wno-c++20-extensions -Wno-attributes -Wno-error=unknown-pragmas -Wno-dangling-reference        -c /workspace/src/contrib/llvm-project/lldb/source/Core/ModuleChild.cpp -o Core/ModuleChild.pico
--- Core/ModuleList.pico ---
/usr/local/bin/x86_64-unknown-freebsd15.1-g++14  --sysroot=/tmp/obj/workspace/src/amd64.amd64/tmp -B/usr/local/x86_64-unknown-freebsd15.1/bin/ -fpic -DPIC  -UPIC -O2 -pipe -fno-common -I/workspace/src/contrib/llvm-project/lldb/include -I/workspace/src/contrib/llvm-project/lldb/source -I/tmp/obj/workspace/src/amd64.amd64/lib/clang/libllvm -I/tmp/obj/workspace/src/amd64.amd64/lib/clang/libclang -I/tmp/obj/workspace/src/amd64.amd64/lib/clang/liblldb -I/workspace/src/contrib/lua/src -I/workspace/src/lib/liblua -I/workspace/src/contrib/llvm-project/clang/include -DCLANG_ENABLE_STATIC_ANALYZER -I/workspace/src/lib/clang/include -I/workspace/src/contrib/llvm-project/llvm/include -D__STDC_CONSTANT_MACROS -D__STDC_FORMAT_MACROS -D__STDC_LIMIT_MACROS -DHAVE_VCS_VERSION_INC -DLLVM_DEFAULT_TARGET_TRIPLE=\"x86_64-unknown-freebsd16.0\" -DLLVM_HOST_TRIPLE=\"x86_64-unknown-freebsd16.0\" -DDEFAULT_SYSROOT=\"\" -DLLVM_TARGET_ENABLE_AARCH64 -DLLVM_TARGET_ENABLE_ARM -DLLVM_TARGET_ENABLE_POWERPC -DLLVM_TARGET_ENABLE_RISCV -DLLVM_TARGET_ENABLE_X86 -DLLVM_NATIVE_ASMPARSER=LLVMInitializeX86AsmParser -DLLVM_NATIVE_ASMPRINTER=LLVMInitializeX86AsmPrinter -DLLVM_NATIVE_DISASSEMBLER=LLVMInitializeX86Disassembler -DLLVM_NATIVE_TARGET=LLVMInitializeX86Target -DLLVM_NATIVE_TARGETINFO=LLVMInitializeX86TargetInfo -DLLVM_NATIVE_TARGETMC=LLVMInitializeX86TargetMC -ffunction-sections -fdata-sections -g1 -MD -MF.depend.Core_ModuleList.pico -MTCore/ModuleList.pico -Wno-format-zero-length -fstack-protector-strong -Wdate-time -Wno-error=address -Wno-error=array-bounds -Wno-error=attributes -Wno-error=bool-compare -Wno-error=cast-align -Wno-error=clobbered -Wno-error=deprecated-declarations -Wno-error=enum-compare -Wno-error=extra -Wno-error=logical-not-parentheses -Wno-error=strict-aliasing -Wno-error=uninitialized -Wno-error=unused-function -Wno-error=unused-value -Wno-error=empty-body -Wno-error=maybe-uninitialized -Wno-error=nonnull-compare -Wno-error=shift-negative-value -Wno-error=tautological-compare -Wno-error=unused-const-variable -Wno-error=bool-operation -Wno-error=deprecated -Wno-error=expansion-to-defined -Wno-error=format-overflow -Wno-error=format-truncation -Wno-error=implicit-fallthrough -Wno-error=int-in-bool-context -Wno-error=memset-elt-size -Wno-error=noexcept-type -Wno-error=nonnull -Wno-error=pointer-compare -Wno-error=stringop-overflow -Wno-error=aggressive-loop-optimizations -Wno-error=cast-function-type -Wno-error=catch-value -Wno-error=multistatement-macros -Wno-error=restrict -Wno-error=sizeof-pointer-memaccess -Wno-error=stringop-truncation -Wno-return-type -Wno-address-of-packed-member -fno-strict-aliasing   -fno-exceptions -fno-rtti -fvisibility-inlines-hidden -g1 -std=c++17  -Wno-attributes -Wno-deprecated-declarations -Wno-error=class-memaccess -Wno-literal-suffix -Wno-c++20-extensions -Wno-attributes -Wno-error=unknown-pragmas -Wno-dangling-reference        -c /workspace/src/contrib/llvm-project/lldb/source/Core/ModuleList.cpp -o Core/ModuleList.pico
--- Core/Disassembler.pico ---
In file included from /tmp/obj/workspace/src/amd64.amd64/tmp/usr/include/c++/v1/__memory/allocator.h:19,
                 from /tmp/obj/workspace/src/amd64.amd64/tmp/usr/include/c++/v1/memory:946,
                 from /workspace/src/contrib/llvm-project/lldb/include/lldb/lldb-forward.h:12,
                 from /workspace/src/contrib/llvm-project/lldb/include/lldb/lldb-types.h:13,
                 from /workspace/src/contrib/llvm-project/lldb/include/lldb/lldb-defines.h:12,
                 from /workspace/src/contrib/llvm-project/lldb/include/lldb/Utility/Stream.h:13,
                 from /workspace/src/contrib/llvm-project/lldb/include/lldb/Core/Address.h:12,
                 from /workspace/src/contrib/llvm-project/lldb/include/lldb/Core/Disassembler.h:12,
                 from /workspace/src/contrib/llvm-project/lldb/source/Core/Disassembler.cpp:9:
In function 'void* std::__1::__libcpp_operator_new(_Args ...) [with _Args = {long unsigned int}]',
    inlined from '_Tp* std::__1::__libcpp_allocate(__element_count, size_t) [with _Tp = shared_ptr<lldb_private::OptionValue>]' at /tmp/obj/workspace/src/amd64.amd64/tmp/usr/include/c++/v1/__new/allocate.h:64:54,
    inlined from '_Tp* std::__1::allocator<_Tp>::allocate(std::__1::size_t) [with _Tp = std::__1::shared_ptr<lldb_private::OptionValue>]' at /tmp/obj/workspace/src/amd64.amd64/tmp/usr/include/c++/v1/__memory/allocator.h:105:41,
    inlined from 'constexpr std::__1::__allocation_result<typename std::__1::allocator_traits<_Alloc>::pointer> std::__1::__allocate_at_least(_Alloc&, size_t) [with _Alloc = allocator<shared_ptr<lldb_private::OptionValue> >]' at /tmp/obj/workspace/src/amd64.amd64/tmp/usr/include/c++/v1/__memory/allocate_at_least.h:41:27,
    inlined from 'std::__1::__split_buffer<_Tp, _Allocator>::__split_buffer(size_type, size_type, __alloc_rr&) [with _Tp = std::__1::shared_ptr<lldb_private::OptionValue>; _Allocator = std::__1::allocator<std::__1::shared_ptr<lldb_private::OptionValue> >&]' at /tmp/obj/workspace/src/amd64.amd64/tmp/usr/include/c++/v1/__split_buffer:330:49,
    inlined from 'std::__1::vector<_Tp, _Alloc>::iterator std::__1::vector<_Tp, _Alloc>::insert(const_iterator, const_reference) [with _Tp = std::__1::shared_ptr<lldb_private::OptionValue>; _Allocator = std::__1::allocator<std::__1::shared_ptr<lldb_private::OptionValue> >]' at /tmp/obj/workspace/src/amd64.amd64/tmp/usr/include/c++/v1/__vector/vector.h:1210:49,
    inlined from 'bool lldb_private::OptionValueArray::InsertValue(size_t, const lldb::OptionValueSP&)' at /workspace/src/contrib/llvm-project/lldb/include/lldb/Interpreter/OptionValueArray.h:85:24,
    inlined from 'lldb::OptionValueSP lldb_private::Instruction::ReadArray(FILE*, lldb_private::Stream&, lldb_private::OptionValue::Type)' at /workspace/src/contrib/llvm-project/lldb/source/Core/Disassembler.cpp:787:49:
/tmp/obj/workspace/src/amd64.amd64/tmp/usr/include/c++/v1/__new/allocate.h:39:24: warning: argument 1 value '18446744073709551600' exceeds maximum object size 9223372036854775807 [-Walloc-size-larger-than=]
   39 |   return ::operator new(__args...);
      |          ~~~~~~~~~~~~~~^~~~~~~~~~~
In file included from /tmp/obj/workspace/src/amd64.amd64/tmp/usr/include/c++/v1/__new/allocate.h:16:
/tmp/obj/workspace/src/amd64.amd64/tmp/usr/include/c++/v1/__new/global_new_delete.h: In member function 'lldb::OptionValueSP lldb_private::Instruction::ReadArray(FILE*, lldb_private::Stream&, lldb_private::OptionValue::Type)':
/tmp/obj/workspace/src/amd64.amd64/tmp/usr/include/c++/v1/__new/global_new_delete.h:37:54: note: in a call to allocation function 'void* operator new(std::__1::size_t)' declared here
   37 | [[__nodiscard__]] _LIBCPP_OVERRIDABLE_FUNC_VIS void* operator new(std::size_t __sz) _THROW_BAD_ALLOC;
      |                                                      ^~~~~~~~
--- Core/Opcode.pico ---
/usr/local/bin/x86_64-unknown-freebsd15.1-g++14  --sysroot=/tmp/obj/workspace/src/amd64.amd64/tmp -B/usr/local/x86_64-unknown-freebsd15.1/bin/ -fpic -DPIC  -UPIC -O2 -pipe -fno-common -I/workspace/src/contrib/llvm-project/lldb/include -I/workspace/src/contrib/llvm-project/lldb/source -I/tmp/obj/workspace/src/amd64.amd64/lib/clang/libllvm -I/tmp/obj/workspace/src/amd64.amd64/lib/clang/libclang -I/tmp/obj/workspace/src/amd64.amd64/lib/clang/liblldb -I/workspace/src/contrib/lua/src -I/workspace/src/lib/liblua -I/workspace/src/contrib/llvm-project/clang/include -DCLANG_ENABLE_STATIC_ANALYZER -I/workspace/src/lib/clang/include -I/workspace/src/contrib/llvm-project/llvm/include -D__STDC_CONSTANT_MACROS -D__STDC_FORMAT_MACROS -D__STDC_LIMIT_MACROS -DHAVE_VCS_VERSION_INC -DLLVM_DEFAULT_TARGET_TRIPLE=\"x86_64-unknown-freebsd16.0\" -DLLVM_HOST_TRIPLE=\"x86_64-unknown-freebsd16.0\" -DDEFAULT_SYSROOT=\"\" -DLLVM_TARGET_ENABLE_AARCH64 -DLLVM_TARGET_ENABLE_ARM -DLLVM_TARGET_ENABLE_POWERPC -DLLVM_TARGET_ENABLE_RISCV -DLLVM_TARGET_ENABLE_X86 -DLLVM_NATIVE_ASMPARSER=LLVMInitializeX86AsmParser -DLLVM_NATIVE_ASMPRINTER=LLVMInitializeX86AsmPrinter -DLLVM_NATIVE_DISASSEMBLER=LLVMInitializeX86Disassembler -DLLVM_NATIVE_TARGET=LLVMInitializeX86Target -DLLVM_NATIVE_TARGETINFO=LLVMInitializeX86TargetInfo -DLLVM_NATIVE_TARGETMC=LLVMInitializeX86TargetMC -ffunction-sections -fdata-sections -g1 -MD -MF.depend.Core_Opcode.pico -MTCore/Opcode.pico -Wno-format-zero-length -fstack-protector-strong -Wdate-time -Wno-error=address -Wno-error=array-bounds -Wno-error=attributes -Wno-error=bool-compare -Wno-error=cast-align -Wno-error=clobbered -Wno-error=deprecated-declarations -Wno-error=enum-compare -Wno-error=extra -Wno-error=logical-not-parentheses -Wno-error=strict-aliasing -Wno-error=uninitialized -Wno-error=unused-function -Wno-error=unused-value -Wno-error=empty-body -Wno-error=maybe-uninitialized -Wno-error=nonnull-compare -Wno-error=shift-negative-value -Wno-error=tautological-compare -Wno-error=unused-const-variable -Wno-error=bool-operation -Wno-error=deprecated -Wno-error=expansion-to-defined -Wno-error=format-overflow -Wno-error=format-truncation -Wno-error=implicit-fallthrough -Wno-error=int-in-bool-context -Wno-error=memset-elt-size -Wno-error=noexcept-type -Wno-error=nonnull -Wno-error=pointer-compare -Wno-error=stringop-overflow -Wno-error=aggressive-loop-optimizations -Wno-error=cast-function-type -Wno-error=catch-value -Wno-error=multistatement-macros -Wno-error=restrict -Wno-error=sizeof-pointer-memaccess -Wno-error=stringop-truncation -Wno-return-type -Wno-address-of-packed-member -fno-strict-aliasing   -fno-exceptions -fno-rtti -fvisibility-inlines-hidden -g1 -std=c++17  -Wno-attributes -Wno-deprecated-declarations -Wno-error=class-memaccess -Wno-literal-suffix -Wno-c++20-extensions -Wno-attributes -Wno-error=unknown-pragmas -Wno-dangling-reference        -c /workspace/src/contrib/llvm-project/lldb/source/Core/Opcode.cpp -o Core/Opcode.pico
FATAL: command execution failed
java.nio.channels.ClosedChannelException
	at org.jenkinsci.remoting.protocol.impl.ChannelApplicationLayer.onReadClosed(ChannelApplicationLayer.java:241)
	at org.jenkinsci.remoting.protocol.ApplicationLayer.onRecvClosed(ApplicationLayer.java:221)
	at org.jenkinsci.remoting.protocol.ProtocolStack$Ptr.onRecvClosed(ProtocolStack.java:826)
	at org.jenkinsci.remoting.protocol.FilterLayer.onRecvClosed(FilterLayer.java:289)
	at org.jenkinsci.remoting.protocol.impl.SSLEngineFilterLayer.onRecvClosed(SSLEngineFilterLayer.java:176)
	at org.jenkinsci.remoting.protocol.impl.SSLEngineFilterLayer.switchToNoSecure(SSLEngineFilterLayer.java:278)
	at org.jenkinsci.remoting.protocol.impl.SSLEngineFilterLayer.processWrite(SSLEngineFilterLayer.java:502)
	at org.jenkinsci.remoting.protocol.impl.SSLEngineFilterLayer.processQueuedWrites(SSLEngineFilterLayer.java:243)
	at org.jenkinsci.remoting.protocol.impl.SSLEngineFilterLayer.doSend(SSLEngineFilterLayer.java:195)
	at org.jenkinsci.remoting.protocol.impl.SSLEngineFilterLayer.doCloseSend(SSLEngineFilterLayer.java:208)
	at org.jenkinsci.remoting.protocol.ProtocolStack$Ptr.doCloseSend(ProtocolStack.java:794)
	at org.jenkinsci.remoting.protocol.ApplicationLayer.doCloseWrite(ApplicationLayer.java:172)
	at org.jenkinsci.remoting.protocol.impl.ChannelApplicationLayer$ByteBufferCommandTransport.closeWrite(ChannelApplicationLayer.java:348)
	at hudson.remoting.Channel.close(Channel.java:1619)
	at hudson.remoting.Channel.close(Channel.java:1567)
	at hudson.slaves.SlaveComputer.closeChannel(SlaveComputer.java:954)
	at hudson.slaves.SlaveComputer.lambda$disconnect$1(SlaveComputer.java:825)
	at jenkins.util.ContextResettingExecutorService.lambda$wrap$0(ContextResettingExecutorService.java:26)
	at jenkins.security.ImpersonatingExecutorService.lambda$wrap$0(ImpersonatingExecutorService.java:66)
	at jenkins.util.ErrorLoggingExecutorService.lambda$wrap$0(ErrorLoggingExecutorService.java:51)
	at java.base/java.util.concurrent.Executors$RunnableAdapter.call(Executors.java:545)
	at java.base/java.util.concurrent.FutureTask.run(FutureTask.java:328)
	at java.base/java.util.concurrent.ThreadPoolExecutor.runWorker(ThreadPoolExecutor.java:1090)
	at java.base/java.util.concurrent.ThreadPoolExecutor$Worker.run(ThreadPoolExecutor.java:614)
	at java.base/java.lang.Thread.run(Thread.java:1474)
Caused: java.io.IOException: Backing channel 'JNLP4-connect connection from gawain2.nyi.freebsd.org/[2610:1c1:1:607c:0:0:16:200]:57537' is disconnected.
	at hudson.remoting.RemoteInvocationHandler.channelOrFail(RemoteInvocationHandler.java:227)
	at hudson.remoting.RemoteInvocationHandler.invoke(RemoteInvocationHandler.java:306)
	at jdk.proxy2/jdk.proxy2.$Proxy236.isAlive(Unknown Source)
	at hudson.Launcher$RemoteLauncher$ProcImpl.isAlive(Launcher.java:1227)
	at hudson.Launcher$RemoteLauncher$ProcImpl.join(Launcher.java:1219)
	at hudson.tasks.CommandInterpreter.join(CommandInterpreter.java:195)
	at hudson.tasks.CommandInterpreter.perform(CommandInterpreter.java:145)
	at hudson.tasks.CommandInterpreter.perform(CommandInterpreter.java:92)
	at hudson.tasks.BuildStepMonitor$1.perform(BuildStepMonitor.java:20)
	at hudson.model.AbstractBuild$AbstractBuildExecution.perform(AbstractBuild.java:817)
	at hudson.model.Build$BuildExecution.build(Build.java:199)
	at hudson.model.Build$BuildExecution.doRun(Build.java:164)
	at hudson.model.AbstractBuild$AbstractBuildExecution.run(AbstractBuild.java:526)
	at hudson.model.Run.execute(Run.java:1849)
	at hudson.model.FreeStyleBuild.run(FreeStyleBuild.java:44)
	at hudson.model.ResourceController.execute(ResourceController.java:97)
	at hudson.model.Executor.run(Executor.java:456)
FATAL: Unable to delete script file /tmp/jenkins8707178668703363364.sh
java.nio.channels.ClosedChannelException
	at org.jenkinsci.remoting.protocol.impl.ChannelApplicationLayer.onReadClosed(ChannelApplicationLayer.java:241)
	at org.jenkinsci.remoting.protocol.ApplicationLayer.onRecvClosed(ApplicationLayer.java:221)
	at org.jenkinsci.remoting.protocol.ProtocolStack$Ptr.onRecvClosed(ProtocolStack.java:826)
	at org.jenkinsci.remoting.protocol.FilterLayer.onRecvClosed(FilterLayer.java:289)
	at org.jenkinsci.remoting.protocol.impl.SSLEngineFilterLayer.onRecvClosed(SSLEngineFilterLayer.java:176)
	at org.jenkinsci.remoting.protocol.impl.SSLEngineFilterLayer.switchToNoSecure(SSLEngineFilterLayer.java:278)
	at org.jenkinsci.remoting.protocol.impl.SSLEngineFilterLayer.processWrite(SSLEngineFilterLayer.java:502)
	at org.jenkinsci.remoting.protocol.impl.SSLEngineFilterLayer.processQueuedWrites(SSLEngineFilterLayer.java:243)
	at org.jenkinsci.remoting.protocol.impl.SSLEngineFilterLayer.doSend(SSLEngineFilterLayer.java:195)
	at org.jenkinsci.remoting.protocol.impl.SSLEngineFilterLayer.doCloseSend(SSLEngineFilterLayer.java:208)
	at org.jenkinsci.remoting.protocol.ProtocolStack$Ptr.doCloseSend(ProtocolStack.java:794)
	at org.jenkinsci.remoting.protocol.ApplicationLayer.doCloseWrite(ApplicationLayer.java:172)
	at org.jenkinsci.remoting.protocol.impl.ChannelApplicationLayer$ByteBufferCommandTransport.closeWrite(ChannelApplicationLayer.java:348)
	at hudson.remoting.Channel.close(Channel.java:1619)
	at hudson.remoting.Channel.close(Channel.java:1567)
	at hudson.slaves.SlaveComputer.closeChannel(SlaveComputer.java:954)
	at hudson.slaves.SlaveComputer.lambda$disconnect$1(SlaveComputer.java:825)
	at jenkins.util.ContextResettingExecutorService.lambda$wrap$0(ContextResettingExecutorService.java:26)
	at jenkins.security.ImpersonatingExecutorService.lambda$wrap$0(ImpersonatingExecutorService.java:66)
	at jenkins.util.ErrorLoggingExecutorService.lambda$wrap$0(ErrorLoggingExecutorService.java:51)
	at java.base/java.util.concurrent.Executors$RunnableAdapter.call(Executors.java:545)
	at java.base/java.util.concurrent.FutureTask.run(FutureTask.java:328)
	at java.base/java.util.concurrent.ThreadPoolExecutor.runWorker(ThreadPoolExecutor.java:1090)
	at java.base/java.util.concurrent.ThreadPoolExecutor$Worker.run(ThreadPoolExecutor.java:614)
	at java.base/java.lang.Thread.run(Thread.java:1474)
Caused: hudson.remoting.ChannelClosedException: Channel "hudson.remoting.Channel@4b6d537f:JNLP4-connect connection from gawain2.nyi.freebsd.org/[2610:1c1:1:607c:0:0:16:200]:57537": Remote call on JNLP4-connect connection from gawain2.nyi.freebsd.org/[2610:1c1:1:607c:0:0:16:200]:57537 failed. The channel is closing down or has closed down
	at hudson.remoting.Channel.call(Channel.java:1101)
	at hudson.FilePath.act(FilePath.java:1220)
	at hudson.FilePath.act(FilePath.java:1209)
	at hudson.FilePath.delete(FilePath.java:1756)
	at hudson.tasks.CommandInterpreter.perform(CommandInterpreter.java:163)
	at hudson.tasks.CommandInterpreter.perform(CommandInterpreter.java:92)
	at hudson.tasks.BuildStepMonitor$1.perform(BuildStepMonitor.java:20)
	at hudson.model.AbstractBuild$AbstractBuildExecution.perform(AbstractBuild.java:817)
	at hudson.model.Build$BuildExecution.build(Build.java:199)
	at hudson.model.Build$BuildExecution.doRun(Build.java:164)
	at hudson.model.AbstractBuild$AbstractBuildExecution.run(AbstractBuild.java:526)
	at hudson.model.Run.execute(Run.java:1849)
	at hudson.model.FreeStyleBuild.run(FreeStyleBuild.java:44)
	at hudson.model.ResourceController.execute(ResourceController.java:97)
	at hudson.model.Executor.run(Executor.java:456)
Build step 'Execute shell' marked build as failure
[PostBuildScript] - [INFO] Executing post build scripts.
ERROR: Build step failed with exception
java.lang.NullPointerException: no workspace from node hudson.slaves.DumbSlave[gawain2.nyi.freebsd.org] which is computer hudson.slaves.SlaveComputer@6c118572[gawain2.nyi.freebsd.org] and has channel null
	at hudson.tasks.CommandInterpreter.perform(CommandInterpreter.java:114)
	at hudson.tasks.CommandInterpreter.perform(CommandInterpreter.java:92)
	at PluginClassLoader for postbuildscript//org.jenkinsci.plugins.postbuildscript.processor.Processor.processBuildSteps(Processor.java:178)
	at PluginClassLoader for postbuildscript//org.jenkinsci.plugins.postbuildscript.processor.Processor.processScripts(Processor.java:90)
	at PluginClassLoader for postbuildscript//org.jenkinsci.plugins.postbuildscript.processor.Processor.process(Processor.java:78)
	at PluginClassLoader for postbuildscript//org.jenkinsci.plugins.postbuildscript.processor.Processor.process(Processor.java:72)
	at PluginClassLoader for postbuildscript//org.jenkinsci.plugins.postbuildscript.PostBuildScript.perform(PostBuildScript.java:76)
	at hudson.tasks.BuildStepMonitor$1.perform(BuildStepMonitor.java:20)
	at hudson.model.AbstractBuild$AbstractBuildExecution.perform(AbstractBuild.java:817)
	at hudson.model.AbstractBuild$AbstractBuildExecution.performAllBuildSteps(AbstractBuild.java:766)
	at hudson.model.Build$BuildExecution.post2(Build.java:179)
	at hudson.model.AbstractBuild$AbstractBuildExecution.post(AbstractBuild.java:710)
	at hudson.model.Run.execute(Run.java:1872)
	at hudson.model.FreeStyleBuild.run(FreeStyleBuild.java:44)
	at hudson.model.ResourceController.execute(ResourceController.java:97)
	at hudson.model.Executor.run(Executor.java:456)
Build step 'Execute scripts' marked build as failure
Checking for post-build
Performing post-build step
Checking if email needs to be generated
Email was triggered for: Failure - Any
Sending email for trigger: Failure - Any
Sending mail from default account using System Admin e-mail address