FreeBSD-stable-15-amd64-test - Build #1176 - Still Unstable
Date: Wed, 14 Oct 2026 00:30:39 UTC
FreeBSD-stable-15-amd64-test - Build #1176 (3e4c62b920933a706213670049b2e5287d553afd) - Still Unstable
Build information: https://ci.FreeBSD.org/job/FreeBSD-stable-15-amd64-test/1176/
Full change log: https://ci.FreeBSD.org/job/FreeBSD-stable-15-amd64-test/1176/changes
Full build log: https://ci.FreeBSD.org/job/FreeBSD-stable-15-amd64-test/1176/console
Status explanation:
"Unstable" - some tests are suspected being broken by the following changes
"Still Unstable" - the failing test cases have not been fixed by these
following changes and this is a notification to note that
these changes have not been fully tested by the CI system
Change summaries:
(Those commits are likely but not certainly responsible)
3e4c62b920933a706213670049b2e5287d553afd by cy:
wpa: Update to 2.12
The failed test cases:
3 tests failed.
FAILED: sys.netpfil.pf.igmp.py.TestIGMP::test_ip_opts
Error Message:
/usr/local/lib/python3.12/site-packages/scapy/packet.py:1985: AttributeError
FAILED: sys.netpfil.pf.pfsync.bulk
Error Message:
state not found on synced host
FAILED: lib.libexecinfo.sigtramp_test.test_backtrace_sigtramp
Error Message:
/usr/src/lib/libexecinfo/tests/sigtramp_test.c:30: n > 1 not met