FreeBSD-main-amd64-test - Build #29683 - Still Unstable
Date: Mon, 12 Oct 2026 21:02:21 UTC
FreeBSD-main-amd64-test - Build #29683 (a3fbf20c0558ee3c2b88adc0c944e66d074cab7b) - Still Unstable
Build information: https://ci.FreeBSD.org/job/FreeBSD-main-amd64-test/29683/
Full change log: https://ci.FreeBSD.org/job/FreeBSD-main-amd64-test/29683/changes
Full build log: https://ci.FreeBSD.org/job/FreeBSD-main-amd64-test/29683/console
Status explanation:
"Unstable" - some tests are suspected being broken by the following changes
"Still Unstable" - the failing test cases have not been fixed by these
following changes and this is a notification to note that
these changes have not been fully tested by the CI system
Change summaries:
(Those commits are likely but not certainly responsible)
000856156745f1a9a05705f8a499c0fd84f183ca by dim:
compiler-rt: enable use of .preinit_array after ef758b59a44e
6b0f64133cd930fec8971aa85f4ef36a67b8334f by dim:
Merge commit 681c2ee4dfbf from llvm-project (by Justin King):
a3fbf20c0558ee3c2b88adc0c944e66d074cab7b by dim:
Merge commit a5fa4dba6e2e from llvm-project (by PiJoules):
The failed test cases:
10 tests failed.
FAILED: lib.libc.sys.poll_test.poll_3way
Error Message:
Test case body timed out
FAILED: usr.bin.diff.diff_test.dirloop
Error Message:
Test case body timed out
FAILED: sys.netpfil.pf.pfsync.bulk
Error Message:
state not found on synced host
FAILED: sys.kern.ssl_sendfile.eagain_vs_eof
Error Message:
/usr/src/tests/sys/kern/ssl_sendfile.c:485: c.sbytes == -1 not met
FAILED: sys.kern.ssl_sendfile.grow
Error Message:
Test case body timed out
FAILED: sys.kern.ssl_sendfile.truncate
Error Message:
Test case body timed out
FAILED: lib.libexecinfo.sigtramp_test.test_backtrace_sigtramp
Error Message:
/usr/src/lib/libexecinfo/tests/sigtramp_test.c:30: n > 1 not met
FAILED: sys.net.if_lagg_test.witness
Error Message:
Lock-order reversals involving if_lagg.c detected
FAILED: sys.netinet.udp_bindings.connect_bound_socket_from_2address_jail
Error Message:
/usr/src/tests/sys/netinet/udp_bindings.c:244: connect(s, (struct sockaddr *)&sin, sizeof(sin)) == 0 not met
FAILED: sys.netlink.netlink_socket.overflow
Error Message:
/usr/src/tests/sys/netlink/netlink_socket.c:146: send(fd, &hdr, sizeof(hdr), 0) == sizeof(hdr) not met