FreeBSD-stable-15-amd64-test - Build #1172 - Still Unstable

From: <jenkins-admin_at_FreeBSD.org>
Date: Mon, 12 Oct 2026 20:42:27 UTC
FreeBSD-stable-15-amd64-test - Build #1172 (975bdb89ecdd939adcd51b5f9d27ea99939b2cbb) - Still Unstable

Build information: https://ci.FreeBSD.org/job/FreeBSD-stable-15-amd64-test/1172/
Full change log: https://ci.FreeBSD.org/job/FreeBSD-stable-15-amd64-test/1172/changes
Full build log: https://ci.FreeBSD.org/job/FreeBSD-stable-15-amd64-test/1172/console

Status explanation:
"Unstable" - some tests are suspected being broken by the following changes
"Still Unstable" - the failing test cases have not been fixed by these
                   following changes and this is a notification to note that
                   these changes have not been fully tested by the CI system

Change summaries:
(Those commits are likely but not certainly responsible)

07d5d9ca2e6fe5a5373b4dd8aa7d2bc809bbf80d by emaste:
aq: Use the common RSS key without options RSS

5c2e2eba99f633298e13b3cd53af5d63501a7d00 by emaste:
aq: Invalidate the descriptor cache after stopping all rings

dfe2ff8fd33f0c8d7af9319d8bea11de2e3c92db by emaste:
aq: Report partial initialization failures to iflib

975bdb89ecdd939adcd51b5f9d27ea99939b2cbb by mchoo:
Fix build failure after f02a5391295e



The failed test cases:

4 tests failed.
FAILED:  sys.netpfil.pf.igmp.py.TestIGMP::test_ip_opts

Error Message:
/usr/local/lib/python3.12/site-packages/scapy/packet.py:1985: AttributeError

FAILED:  usr.bin.limits.limits_test.cputime_hard_flag

Error Message:
atf-check failed; see the output of the test for details

FAILED:  sys.netpfil.pf.pfsync.bulk

Error Message:
state not found on synced host

FAILED:  lib.libexecinfo.sigtramp_test.test_backtrace_sigtramp

Error Message:
/usr/src/lib/libexecinfo/tests/sigtramp_test.c:30: n > 1 not met