FreeBSD-stable-14-amd64-test - Build #2194 - Still Unstable

From: <jenkins-admin_at_FreeBSD.org>
Date: Mon, 12 Oct 2026 19:24:59 UTC
FreeBSD-stable-14-amd64-test - Build #2194 (9d7269c6b726f9148306674e4aeec1a915496515) - Still Unstable

Build information: https://ci.FreeBSD.org/job/FreeBSD-stable-14-amd64-test/2194/
Full change log: https://ci.FreeBSD.org/job/FreeBSD-stable-14-amd64-test/2194/changes
Full build log: https://ci.FreeBSD.org/job/FreeBSD-stable-14-amd64-test/2194/console

Status explanation:
"Unstable" - some tests are suspected being broken by the following changes
"Still Unstable" - the failing test cases have not been fixed by these
                   following changes and this is a notification to note that
                   these changes have not been fully tested by the CI system

Change summaries:
(Those commits are likely but not certainly responsible)

9d7269c6b726f9148306674e4aeec1a915496515 by mchoo:
Fix build failure after 904efcc64398



The failed test cases:

3 tests failed.
FAILED:  sys.kern.ptrace_test.ptrace__follow_fork_child_detached_unrelated_debugger

Error Message:
/usr/src/tests/sys/kern/ptrace_test.c:592: WIFSTOPPED(status) not met

FAILED:  sys.kern.sonewconn_overflow.sonewconn_overflow_01

Error Message:
atf-check failed; see the output of the test for details

FAILED:  sys.netpfil.pf.pfsync.bulk

Error Message:
state not found on synced host