FreeBSD-main-amd64-test - Build #29679 - Still Unstable
Date: Mon, 12 Oct 2026 09:47:18 UTC
FreeBSD-main-amd64-test - Build #29679 (8a7df6c58d549bd2eaa5cad30b2ef93c3eca3c18) - Still Unstable
Build information: https://ci.FreeBSD.org/job/FreeBSD-main-amd64-test/29679/
Full change log: https://ci.FreeBSD.org/job/FreeBSD-main-amd64-test/29679/changes
Full build log: https://ci.FreeBSD.org/job/FreeBSD-main-amd64-test/29679/console
Status explanation:
"Unstable" - some tests are suspected being broken by the following changes
"Still Unstable" - the failing test cases have not been fixed by these
following changes and this is a notification to note that
these changes have not been fully tested by the CI system
Change summaries:
(Those commits are likely but not certainly responsible)
36b849b5c76406bb6d9341bfb1a7f16ae5c189c9 by ngie:
tests/libc: use an allowlist for sbrk in NetBSD-derived tests
e8431fae655be5f3c5b95e091e72960ff713431f by ngie:
Revert "tests/libc: use an allowlist for sbrk in NetBSD-derived tests"
d45f069002f211398fd7790509fbd25ec6d1c713 by ngie:
tests/libc: use an allowlist for sbrk in NetBSD-derived tests
8a7df6c58d549bd2eaa5cad30b2ef93c3eca3c18 by ngie:
tests/libc: only build brk_test where libc provides sbrk
The failed test cases:
8 tests failed.
FAILED: sys.netpfil.pf.syncookie.basic_v6
Error Message:
Failed to connect to syncookie protected echo daemon
FAILED: sys.kern.ssl_sendfile.eagain_vs_eof
Error Message:
/usr/src/tests/sys/kern/ssl_sendfile.c:485: c.sbytes == -1 not met
FAILED: sys.kern.ssl_sendfile.grow
Error Message:
Test case body timed out
FAILED: sys.kern.ssl_sendfile.truncate
Error Message:
Test case body timed out
FAILED: lib.libexecinfo.sigtramp_test.test_backtrace_sigtramp
Error Message:
/usr/src/lib/libexecinfo/tests/sigtramp_test.c:30: n > 1 not met
FAILED: sys.net.if_lagg_test.witness
Error Message:
Lock-order reversals involving if_lagg.c detected
FAILED: sys.netinet.udp_bindings.connect_bound_socket_from_2address_jail
Error Message:
/usr/src/tests/sys/netinet/udp_bindings.c:244: connect(s, (struct sockaddr *)&sin, sizeof(sin)) == 0 not met
FAILED: sys.netlink.netlink_socket.overflow
Error Message:
/usr/src/tests/sys/netlink/netlink_socket.c:146: send(fd, &hdr, sizeof(hdr), 0) == sizeof(hdr) not met