FreeBSD-stable-15-amd64-test - Build #1167 - Still Unstable
Date: Mon, 12 Oct 2026 06:12:26 UTC
FreeBSD-stable-15-amd64-test - Build #1167 (edb100a398bd0bd06ff9dd5cccbd158468b93994) - Still Unstable
Build information: https://ci.FreeBSD.org/job/FreeBSD-stable-15-amd64-test/1167/
Full change log: https://ci.FreeBSD.org/job/FreeBSD-stable-15-amd64-test/1167/changes
Full build log: https://ci.FreeBSD.org/job/FreeBSD-stable-15-amd64-test/1167/console
Status explanation:
"Unstable" - some tests are suspected being broken by the following changes
"Still Unstable" - the failing test cases have not been fixed by these
following changes and this is a notification to note that
these changes have not been fully tested by the CI system
Change summaries:
(Those commits are likely but not certainly responsible)
10191b85ee5d0aa034d1b51b63bd4b7d7af57992 by kib:
cdevsw: add D_NONPASSABLE flag
4c0c1c321eac80dcd46b863e03915f9318d33d22 by kib:
ufssuspend(4): mark non-passable
23c33a97729d9dcb3b8580547d7f461368f597d7 by kib:
devfs_open: do not access dsw after dev_relthread()
edb100a398bd0bd06ff9dd5cccbd158468b93994 by kib:
rtld: fix indent
The failed test cases:
3 tests failed.
FAILED: sys.netpfil.pf.igmp.py.TestIGMP::test_ip_opts
Error Message:
/usr/local/lib/python3.12/site-packages/scapy/packet.py:1985: AttributeError
FAILED: sys.netpfil.pf.route_to.dummynet
Error Message:
atf-check failed; see the output of the test for details
FAILED: lib.libexecinfo.sigtramp_test.test_backtrace_sigtramp
Error Message:
/usr/src/lib/libexecinfo/tests/sigtramp_test.c:30: n > 1 not met