FreeBSD-stable-15-amd64-test - Build #1163 - Still Unstable
Date: Sun, 11 Oct 2026 06:12:44 UTC
FreeBSD-stable-15-amd64-test - Build #1163 (7fdc748c0c3d0f2f7c1c0725f9ff2a5085fc36ec) - Still Unstable
Build information: https://ci.FreeBSD.org/job/FreeBSD-stable-15-amd64-test/1163/
Full change log: https://ci.FreeBSD.org/job/FreeBSD-stable-15-amd64-test/1163/changes
Full build log: https://ci.FreeBSD.org/job/FreeBSD-stable-15-amd64-test/1163/console
Status explanation:
"Unstable" - some tests are suspected being broken by the following changes
"Still Unstable" - the failing test cases have not been fixed by these
following changes and this is a notification to note that
these changes have not been fully tested by the CI system
Change summaries:
(Those commits are likely but not certainly responsible)
ea3fdee608a9fb6f690e22392c9948d45d350e1b by kbowling:
e1000: Correct igb(4) DMA coalescing register programming
2f49578f3d6a1e440f6392136db6e920309511e3 by kbowling:
e1000: Recover from igb(4) controller DEV_RST
0cab2bc676d7f978ebda6cfff324990c70cdb64f by kbowling:
e1000: Rework Wake-on-LAN policy and programming
6a1b101a9f3764f690128dcef2ccea3218680a3e by kbowling:
e1000: Configure PCH low-power link modes for suspend
e10bda7089033ece33bec182e748a8361cf5764e by kbowling:
random: TPM_HARVEST should have been named RANDOM_ENABLE_TPM
fdc186e9793006b08f4954d45c26a58706972aa3 by kbowling:
tpm: fix multi-threaded access with per-open state
7a4e895d3649e188e1ac5c73888acfaedfe22880 by kbowling:
tpm20: Validate suspend and resume commands
2f85c15b52e812f68280ab3eea0af49389465c48 by kbowling:
tpm20: Initialize common state before testing TIS interrupts
55c97a16dfcc1237ba8fdd37175987ca3281b29c by kbowling:
tpm_tis: Restore validated interrupts after resume
0a843d2b14c9cd32e850d18bb7c133adc4564d44 by kbowling:
tpm20: Harden the common device lifecycle
48d997f4366f65501f875ee5100d2b2be01eac7a by kbowling:
tpm_tis: Close interrupt wait races
8e85e2ea8e44fe27aa93593f86ce45e1aef9507b by cperciva:
bsdinstall: Drop "Technology preview" from package sets
bd54c7bd59dfcc9e6243377f9c560099d2b1f65f by kbowling:
tpm_tis: release TPM resources after reading response
3904c7a1c489a419c4691b7a58d2d1e2a3e71d53 by kbowling:
tpm20: Release transport state after command failures
ef68bf61d8db343a812a37016d7f12b6f6e291ef by kbowling:
tpm20: Correct 32-bit register helpers
606ce72478b7f18aebc23df83e34f126b595623a by kbowling:
tpm20: Move user copies outside the lifecycle lock
74f891188b849b0e696bb6c52ad34fb5468edd0d by kbowling:
tpm_tis: Quiesce interrupts before registering a handler
63276290b4e239b4794d52834e1a5fd5095c162d by kbowling:
tpm: Do not use timed tsleep() while polling during cold boot
a81e324a06c5921287c642376a6f73d7729dd469 by kbowling:
tpm: crb: make the Pluton startmethod more resilient
bf62832039d7e72cbbd64ba94c2a80da340f2e83 by kbowling:
tpm: crb: check the error bit only after taking locality
99229e58da67a6fa37f2d89fead6b2b5aed0bba7 by kbowling:
bhyve: allow read/write to full CRB buffer
5329e07a6f50bff44c5c034d5aeee13187c9b242 by kbowling:
bhyve: tpm: allow the last dword of the CRB command buffer
7fdc748c0c3d0f2f7c1c0725f9ff2a5085fc36ec by kbowling:
amd64, powerpc: Enable tpm(4) in supported kernels
The failed test cases:
4 tests failed.
FAILED: sys.fs.fusefs.ext2-misc.execute
Error Message:
atf-check failed; see the output of the test for details
FAILED: sys.netpfil.pf.pfsync.bulk
Error Message:
state not found on synced host
FAILED: usr.sbin.daemon.daemon_test.output_file
Error Message:
atf-check failed; see the output of the test for details
FAILED: lib.libexecinfo.sigtramp_test.test_backtrace_sigtramp
Error Message:
/usr/src/lib/libexecinfo/tests/sigtramp_test.c:30: n > 1 not met