FreeBSD-stable-14-amd64-gcc14_build - Build #1342 - Still Failing
Date: Sun, 11 Oct 2026 05:37:40 UTC
FreeBSD-stable-14-amd64-gcc14_build - Build #1342 (b1023deba6dfd39b84de87eeeebcdec4aecdca62) - Still Failing
Build information: https://ci.FreeBSD.org/job/FreeBSD-stable-14-amd64-gcc14_build/1342/
Full change log: https://ci.FreeBSD.org/job/FreeBSD-stable-14-amd64-gcc14_build/1342/changes
Full build log: https://ci.FreeBSD.org/job/FreeBSD-stable-14-amd64-gcc14_build/1342/console
Status explanation:
"Failure" - the build is suspected being broken by the following changes
"Still Failing" - the build has not been fixed by the following changes and
this is a notification to note that these changes have
not been fully tested by the CI system
Change summaries:
(Those commits are likely but not certainly responsible)
4d015c4c3f94494c05c1cad936dce6dab2501f21 by rmacklem:
clnt_vc.c: Fix handling of backchannel xprt
07c057b5de44e993fb445e70a9e2f77b30b83867 by rmacklem:
clnt_vc.c: Fix handling of broken TCP connections
b1023deba6dfd39b84de87eeeebcdec4aecdca62 by rmacklem:
nfs_nfsdstate.c: Add an extra safety belt check for the backchannel
The end of the build log:
[...truncated 91.99 MiB...]
--- all_subdir_stand ---
--- g_eli_key_cache.o ---
/usr/local/bin/x86_64-unknown-freebsd14.4-gcc14 --sysroot=/tmp/obj/workspace/src/amd64.amd64/tmp -B/usr/local/x86_64-unknown-freebsd14.4/bin/ -O2 -pipe -fno-common -nostdinc -I/tmp/obj/workspace/src/amd64.amd64/stand/libsa32 -I/workspace/src/stand/libsa -D_STANDALONE -I/workspace/src/sys -Ddouble=jagged-little-pill -Dfloat=floaty-mcfloatface -ffunction-sections -fdata-sections -DLOADER_GELI_SUPPORT -I/workspace/src/stand/libsa/geli -DLOADER_DISK_SUPPORT -m32 -ffreestanding -mno-mmx -mno-sse -msoft-float -march=i386 -I. -Iinclude -ffile-prefix-map=/workspace/src=/usr/src -ffile-prefix-map=/tmp/obj/workspace/src=/usr/obj -g -MD -MF.depend.g_eli_key_cache.o -MTg_eli_key_cache.o -std=gnu99 -Wno-format-zero-length -Wsystem-headers -Werror -Wno-pointer-sign -Wdate-time -Wno-error=address -Wno-error=array-bounds -Wno-error=attributes -Wno-error=bool-compare -Wno-error=cast-align -Wno-error=clobbered -Wno-error=deprecated-declarations -Wno-error=enum-compare -Wno-error=extra -Wno-error=logical-not-parentheses -Wno-error=strict-aliasing -Wno-error=uninitialized -Wno-error=unused-function -Wno-error=unused-value -Wno-error=empty-body -Wno-error=maybe-uninitialized -Wno-error=nonnull-compare -Wno-error=shift-negative-value -Wno-error=tautological-compare -Wno-error=unused-const-variable -Wno-error=bool-operation -Wno-error=deprecated -Wno-error=expansion-to-defined -Wno-error=format-overflow -Wno-error=format-truncation -Wno-error=implicit-fallthrough -Wno-error=int-in-bool-context -Wno-error=memset-elt-size -Wno-error=noexcept-type -Wno-error=nonnull -Wno-error=pointer-compare -Wno-error=stringop-overflow -Wno-error=aggressive-loop-optimizations -Wno-error=cast-function-type -Wno-error=catch-value -Wno-error=multistatement-macros -Wno-error=restrict -Wno-error=sizeof-pointer-memaccess -Wno-error=stringop-truncation -Wno-return-type -Wno-address-of-packed-member -Os -mpreferred-stack-boundary=2 -c /workspace/src/sys/geom/eli/g_eli_key_cache.c -o g_eli_key_cache.o
--- all_subdir_sbin ---
--- options.pieo ---
/usr/local/bin/x86_64-unknown-freebsd14.4-gcc14 --sysroot=/tmp/obj/workspace/src/amd64.amd64/tmp -B/usr/local/x86_64-unknown-freebsd14.4/bin/ -fpie -DPIC -O2 -pipe -fno-common -DWITH_CASPER -fPIE -ffile-prefix-map=/workspace/src=/usr/src -ffile-prefix-map=/tmp/obj/workspace/src=/usr/obj -g -MD -MF.depend.options.pieo -MToptions.pieo -std=gnu99 -Wno-format-zero-length -fstack-protector-strong -Wsystem-headers -Werror -Wall -Wno-format-y2k -W -Wno-unused-parameter -Wmissing-prototypes -Wpointer-arith -Wreturn-type -Wcast-qual -Wwrite-strings -Wswitch -Wshadow -Wunused-parameter -Wchar-subscripts -Wnested-externs -Wold-style-definition -Wno-pointer-sign -Wdate-time -Wno-error=address -Wno-error=array-bounds -Wno-error=attributes -Wno-error=bool-compare -Wno-error=cast-align -Wno-error=clobbered -Wno-error=deprecated-declarations -Wno-error=enum-compare -Wno-error=extra -Wno-error=logical-not-parentheses -Wno-error=strict-aliasing -Wno-error=uninitialized -Wno-error=unused-function -Wno-error=unused-value -Wno-error=empty-body -Wno-error=maybe-uninitialized -Wno-error=nonnull-compare -Wno-error=shift-negative-value -Wno-error=tautological-compare -Wno-error=unused-const-variable -Wno-error=bool-operation -Wno-error=deprecated -Wno-error=expansion-to-defined -Wno-error=format-overflow -Wno-error=format-truncation -Wno-error=implicit-fallthrough -Wno-error=int-in-bool-context -Wno-error=memset-elt-size -Wno-error=noexcept-type -Wno-error=nonnull -Wno-error=pointer-compare -Wno-error=stringop-overflow -Wno-error=aggressive-loop-optimizations -Wno-error=cast-function-type -Wno-error=catch-value -Wno-error=multistatement-macros -Wno-error=restrict -Wno-error=sizeof-pointer-memaccess -Wno-error=stringop-truncation -Wno-return-type -c /workspace/src/sbin/dhclient/options.c -o options.pieo
--- all_subdir_stand ---
--- xform_aes_xts.o ---
/usr/local/bin/x86_64-unknown-freebsd14.4-gcc14 --sysroot=/tmp/obj/workspace/src/amd64.amd64/tmp -B/usr/local/x86_64-unknown-freebsd14.4/bin/ -O2 -pipe -fno-common -nostdinc -I/tmp/obj/workspace/src/amd64.amd64/stand/libsa32 -I/workspace/src/stand/libsa -D_STANDALONE -I/workspace/src/sys -Ddouble=jagged-little-pill -Dfloat=floaty-mcfloatface -ffunction-sections -fdata-sections -DLOADER_GELI_SUPPORT -I/workspace/src/stand/libsa/geli -DLOADER_DISK_SUPPORT -m32 -ffreestanding -mno-mmx -mno-sse -msoft-float -march=i386 -I. -Iinclude -ffile-prefix-map=/workspace/src=/usr/src -ffile-prefix-map=/tmp/obj/workspace/src=/usr/obj -g -MD -MF.depend.xform_aes_xts.o -MTxform_aes_xts.o -std=gnu99 -Wno-format-zero-length -Wsystem-headers -Werror -Wno-pointer-sign -Wdate-time -Wno-error=address -Wno-error=array-bounds -Wno-error=attributes -Wno-error=bool-compare -Wno-error=cast-align -Wno-error=clobbered -Wno-error=deprecated-declarations -Wno-error=enum-compare -Wno-error=extra -Wno-error=logical-not-parentheses -Wno-error=strict-aliasing -Wno-error=uninitialized -Wno-error=unused-function -Wno-error=unused-value -Wno-error=empty-body -Wno-error=maybe-uninitialized -Wno-error=nonnull-compare -Wno-error=shift-negative-value -Wno-error=tautological-compare -Wno-error=unused-const-variable -Wno-error=bool-operation -Wno-error=deprecated -Wno-error=expansion-to-defined -Wno-error=format-overflow -Wno-error=format-truncation -Wno-error=implicit-fallthrough -Wno-error=int-in-bool-context -Wno-error=memset-elt-size -Wno-error=noexcept-type -Wno-error=nonnull -Wno-error=pointer-compare -Wno-error=stringop-overflow -Wno-error=aggressive-loop-optimizations -Wno-error=cast-function-type -Wno-error=catch-value -Wno-error=multistatement-macros -Wno-error=restrict -Wno-error=sizeof-pointer-memaccess -Wno-error=stringop-truncation -Wno-return-type -Wno-address-of-packed-member -Os -mpreferred-stack-boundary=2 -c /workspace/src/sys/opencrypto/xform_aes_xts.c -o xform_aes_xts.o
--- all_subdir_cddl ---
--- list.pieo ---
/usr/local/bin/x86_64-unknown-freebsd14.4-gcc14 --sysroot=/tmp/obj/workspace/src/amd64.amd64/tmp -B/usr/local/x86_64-unknown-freebsd14.4/bin/ -fpie -DPIC -O2 -pipe -fno-common -DIN_BASE -I/workspace/src/sys/contrib/openzfs/include -I/workspace/src/sys/contrib/openzfs/lib/libspl/include/ -I/workspace/src/sys/contrib/openzfs/lib/libspl/include/os/freebsd -I/workspace/src/cddl/compat/opensolaris/include -I/workspace/src/sys/cddl/compat/opensolaris -I/workspace/src/cddl/compat/opensolaris/include -I/workspace/src/cddl/usr.bin/ctfconvert/../../../cddl/contrib/opensolaris -I/workspace/src/cddl/usr.bin/ctfconvert/../../../sys/cddl/contrib/opensolaris -I/workspace/src/cddl/usr.bin/ctfconvert/../../../cddl/contrib/opensolaris/head -I/workspace/src/cddl/usr.bin/ctfconvert/../../../cddl/contrib/opensolaris/tools/ctf/common -I/workspace/src/cddl/usr.bin/ctfconvert/../../../cddl/contrib/opensolaris/tools/ctf/cvt -I/workspace/src/cddl/usr.bin/ctfconvert/../../../sys/cddl/contrib/opensolaris/uts/common -DHAVE_ISSETUGID -DNEED_SOLARIS_BOOLEAN -fPIE -ffile-prefix-map=/workspace/src=/usr/src -ffile-prefix-map=/tmp/obj/workspace/src=/usr/obj -g -MD -MF.depend.list.pieo -MTlist.pieo -std=gnu99 -Wno-format-zero-length -fstack-protector-strong -Wsystem-headers -Werror -Wall -Wno-format-y2k -W -Wno-unused-parameter -Wmissing-prototypes -Wpointer-arith -Wreturn-type -Wcast-qual -Wwrite-strings -Wswitch -Wshadow -Wunused-parameter -Wcast-align -Wchar-subscripts -Wnested-externs -Wold-style-definition -Wno-pointer-sign -Wdate-time -Wno-error=address -Wno-error=array-bounds -Wno-error=attributes -Wno-error=bool-compare -Wno-error=cast-align -Wno-error=clobbered -Wno-error=deprecated-declarations -Wno-error=enum-compare -Wno-error=extra -Wno-error=logical-not-parentheses -Wno-error=strict-aliasing -Wno-error=uninitialized -Wno-error=unused-function -Wno-error=unused-value -Wno-error=empty-body -Wno-error=maybe-uninitialized -Wno-error=nonnull-compare -Wno-error=shift-negative-value -Wno-error=tautological-compare -Wno-error=unused-const-variable -Wno-error=bool-operation -Wno-error=deprecated -Wno-error=expansion-to-defined -Wno-error=format-overflow -Wno-error=format-truncation -Wno-error=implicit-fallthrough -Wno-error=int-in-bool-context -Wno-error=memset-elt-size -Wno-error=noexcept-type -Wno-error=nonnull -Wno-error=pointer-compare -Wno-error=stringop-overflow -Wno-error=aggressive-loop-optimizations -Wno-error=cast-function-type -Wno-error=catch-value -Wno-error=multistatement-macros -Wno-error=restrict -Wno-error=sizeof-pointer-memaccess -Wno-error=stringop-truncation -Wno-return-type -Wno-unknown-pragmas -c /workspace/src/cddl/contrib/opensolaris/tools/ctf/common/list.c -o list.pieo
--- all_subdir_share ---
--- uk_UA.CP1251.LC_CTYPE ---
localedef -l -D -U -c -w /workspace/src/share/ctypedef/../../tools/tools/locale/etc/final-maps/widths.txt -f /workspace/src/share/ctypedef/../../tools/tools/locale/etc/final-maps/map.CP1251 -i /workspace/src/share/ctypedef/uk_UA.CP1251.src /tmp/obj/workspace/src/amd64.amd64/share/ctypedef/uk_UA.CP1251
--- all_subdir_stand ---
--- zfs.o ---
/usr/local/bin/x86_64-unknown-freebsd14.4-gcc14 --sysroot=/tmp/obj/workspace/src/amd64.amd64/tmp -B/usr/local/x86_64-unknown-freebsd14.4/bin/ -O2 -pipe -fno-common -nostdinc -I/workspace/src/stand/libsa/zfs/spl -I/workspace/src/sys/contrib/openzfs/include/os/freebsd -I/workspace/src/sys/contrib/openzfs/include/os/freebsd/spl -I/workspace/src/sys/contrib/openzfs/include/os/freebsd/zfs -I/tmp/obj/workspace/src/amd64.amd64/stand/libsa32 -I/workspace/src/stand/libsa -D_STANDALONE -I/workspace/src/sys -Ddouble=jagged-little-pill -Dfloat=floaty-mcfloatface -ffunction-sections -fdata-sections -DLOADER_GELI_SUPPORT -I/workspace/src/stand/libsa/geli -DLOADER_DISK_SUPPORT -m32 -ffreestanding -mno-mmx -mno-sse -msoft-float -march=i386 -I. -Iinclude -ffile-prefix-map=/workspace/src=/usr/src -ffile-prefix-map=/tmp/obj/workspace/src=/usr/obj -g -MD -MF.depend.zfs.o -MTzfs.o -std=gnu99 -Wno-format-zero-length -Wsystem-headers -Werror -Wno-pointer-sign -Wdate-time -Wno-error=address -Wno-error=array-bounds -Wno-error=attributes -Wno-error=bool-compare -Wno-error=cast-align -Wno-error=clobbered -Wno-error=deprecated-declarations -Wno-error=enum-compare -Wno-error=extra -Wno-error=logical-not-parentheses -Wno-error=strict-aliasing -Wno-error=uninitialized -Wno-error=unused-function -Wno-error=unused-value -Wno-error=empty-body -Wno-error=maybe-uninitialized -Wno-error=nonnull-compare -Wno-error=shift-negative-value -Wno-error=tautological-compare -Wno-error=unused-const-variable -Wno-error=bool-operation -Wno-error=deprecated -Wno-error=expansion-to-defined -Wno-error=format-overflow -Wno-error=format-truncation -Wno-error=implicit-fallthrough -Wno-error=int-in-bool-context -Wno-error=memset-elt-size -Wno-error=noexcept-type -Wno-error=nonnull -Wno-error=pointer-compare -Wno-error=stringop-overflow -Wno-error=aggressive-loop-optimizations -Wno-error=cast-function-type -Wno-error=catch-value -Wno-error=multistatement-macros -Wno-error=restrict -Wno-error=sizeof-pointer-memaccess -Wno-error=stringop-truncation -Wno-return-type -Wno-address-of-packed-member -Wno-dangling-pointer -Os -mpreferred-stack-boundary=2 -include /workspace/src/sys/contrib/openzfs/include/os/freebsd/spl/sys/ccompile.h -Wformat -Wall -I/workspace/src/sys/contrib/openzfs/include -DNEED_SOLARIS_BOOLEAN -DHAS_ZSTD_ZFS -I/workspace/src/sys/cddl/boot/zfs -I/workspace/src/stand/common -I/workspace/src/sys/crypto/skein -I/workspace/src/sys/cddl/contrib/opensolaris/common/lz4 -c /workspace/src/stand/libsa/zfs/zfs.c -o zfs.o
--- all_subdir_cddl ---
--- memory.pieo ---
/usr/local/bin/x86_64-unknown-freebsd14.4-gcc14 --sysroot=/tmp/obj/workspace/src/amd64.amd64/tmp -B/usr/local/x86_64-unknown-freebsd14.4/bin/ -fpie -DPIC -O2 -pipe -fno-common -DIN_BASE -I/workspace/src/sys/contrib/openzfs/include -I/workspace/src/sys/contrib/openzfs/lib/libspl/include/ -I/workspace/src/sys/contrib/openzfs/lib/libspl/include/os/freebsd -I/workspace/src/cddl/compat/opensolaris/include -I/workspace/src/sys/cddl/compat/opensolaris -I/workspace/src/cddl/compat/opensolaris/include -I/workspace/src/cddl/usr.bin/ctfconvert/../../../cddl/contrib/opensolaris -I/workspace/src/cddl/usr.bin/ctfconvert/../../../sys/cddl/contrib/opensolaris -I/workspace/src/cddl/usr.bin/ctfconvert/../../../cddl/contrib/opensolaris/head -I/workspace/src/cddl/usr.bin/ctfconvert/../../../cddl/contrib/opensolaris/tools/ctf/common -I/workspace/src/cddl/usr.bin/ctfconvert/../../../cddl/contrib/opensolaris/tools/ctf/cvt -I/workspace/src/cddl/usr.bin/ctfconvert/../../../sys/cddl/contrib/opensolaris/uts/common -DHAVE_ISSETUGID -DNEED_SOLARIS_BOOLEAN -fPIE -ffile-prefix-map=/workspace/src=/usr/src -ffile-prefix-map=/tmp/obj/workspace/src=/usr/obj -g -MD -MF.depend.memory.pieo -MTmemory.pieo -std=gnu99 -Wno-format-zero-length -fstack-protector-strong -Wsystem-headers -Werror -Wall -Wno-format-y2k -W -Wno-unused-parameter -Wmissing-prototypes -Wpointer-arith -Wreturn-type -Wcast-qual -Wwrite-strings -Wswitch -Wshadow -Wunused-parameter -Wcast-align -Wchar-subscripts -Wnested-externs -Wold-style-definition -Wno-pointer-sign -Wdate-time -Wno-error=address -Wno-error=array-bounds -Wno-error=attributes -Wno-error=bool-compare -Wno-error=cast-align -Wno-error=clobbered -Wno-error=deprecated-declarations -Wno-error=enum-compare -Wno-error=extra -Wno-error=logical-not-parentheses -Wno-error=strict-aliasing -Wno-error=uninitialized -Wno-error=unused-function -Wno-error=unused-value -Wno-error=empty-body -Wno-error=maybe-uninitialized -Wno-error=nonnull-compare -Wno-error=shift-negative-value -Wno-error=tautological-compare -Wno-error=unused-const-variable -Wno-error=bool-operation -Wno-error=deprecated -Wno-error=expansion-to-defined -Wno-error=format-overflow -Wno-error=format-truncation -Wno-error=implicit-fallthrough -Wno-error=int-in-bool-context -Wno-error=memset-elt-size -Wno-error=noexcept-type -Wno-error=nonnull -Wno-error=pointer-compare -Wno-error=stringop-overflow -Wno-error=aggressive-loop-optimizations -Wno-error=cast-function-type -Wno-error=catch-value -Wno-error=multistatement-macros -Wno-error=restrict -Wno-error=sizeof-pointer-memaccess -Wno-error=stringop-truncation -Wno-return-type -Wno-unknown-pragmas -c /workspace/src/cddl/contrib/opensolaris/tools/ctf/common/memory.c -o memory.pieo
--- merge.pieo ---
/usr/local/bin/x86_64-unknown-freebsd14.4-gcc14 --sysroot=/tmp/obj/workspace/src/amd64.amd64/tmp -B/usr/local/x86_64-unknown-freebsd14.4/bin/ -fpie -DPIC -O2 -pipe -fno-common -DIN_BASE -I/workspace/src/sys/contrib/openzfs/include -I/workspace/src/sys/contrib/openzfs/lib/libspl/include/ -I/workspace/src/sys/contrib/openzfs/lib/libspl/include/os/freebsd -I/workspace/src/cddl/compat/opensolaris/include -I/workspace/src/sys/cddl/compat/opensolaris -I/workspace/src/cddl/compat/opensolaris/include -I/workspace/src/cddl/usr.bin/ctfconvert/../../../cddl/contrib/opensolaris -I/workspace/src/cddl/usr.bin/ctfconvert/../../../sys/cddl/contrib/opensolaris -I/workspace/src/cddl/usr.bin/ctfconvert/../../../cddl/contrib/opensolaris/head -I/workspace/src/cddl/usr.bin/ctfconvert/../../../cddl/contrib/opensolaris/tools/ctf/common -I/workspace/src/cddl/usr.bin/ctfconvert/../../../cddl/contrib/opensolaris/tools/ctf/cvt -I/workspace/src/cddl/usr.bin/ctfconvert/../../../sys/cddl/contrib/opensolaris/uts/common -DHAVE_ISSETUGID -DNEED_SOLARIS_BOOLEAN -fPIE -ffile-prefix-map=/workspace/src=/usr/src -ffile-prefix-map=/tmp/obj/workspace/src=/usr/obj -g -MD -MF.depend.merge.pieo -MTmerge.pieo -std=gnu99 -Wno-format-zero-length -fstack-protector-strong -Wsystem-headers -Werror -Wall -Wno-format-y2k -W -Wno-unused-parameter -Wmissing-prototypes -Wpointer-arith -Wreturn-type -Wcast-qual -Wwrite-strings -Wswitch -Wshadow -Wunused-parameter -Wcast-align -Wchar-subscripts -Wnested-externs -Wold-style-definition -Wno-pointer-sign -Wdate-time -Wno-error=address -Wno-error=array-bounds -Wno-error=attributes -Wno-error=bool-compare -Wno-error=cast-align -Wno-error=clobbered -Wno-error=deprecated-declarations -Wno-error=enum-compare -Wno-error=extra -Wno-error=logical-not-parentheses -Wno-error=strict-aliasing -Wno-error=uninitialized -Wno-error=unused-function -Wno-error=unused-value -Wno-error=empty-body -Wno-error=maybe-uninitialized -Wno-error=nonnull-compare -Wno-error=shift-negative-value -Wno-error=tautological-compare -Wno-error=unused-const-variable -Wno-error=bool-operation -Wno-error=deprecated -Wno-error=expansion-to-defined -Wno-error=format-overflow -Wno-error=format-truncation -Wno-error=implicit-fallthrough -Wno-error=int-in-bool-context -Wno-error=memset-elt-size -Wno-error=noexcept-type -Wno-error=nonnull -Wno-error=pointer-compare -Wno-error=stringop-overflow -Wno-error=aggressive-loop-optimizations -Wno-error=cast-function-type -Wno-error=catch-value -Wno-error=multistatement-macros -Wno-error=restrict -Wno-error=sizeof-pointer-memaccess -Wno-error=stringop-truncation -Wno-return-type -Wno-unknown-pragmas -c /workspace/src/cddl/contrib/opensolaris/tools/ctf/cvt/merge.c -o merge.pieo
--- all_subdir_share ---
--- zh_CN.GB18030.LC_CTYPE ---
localedef -l -D -U -c -w /workspace/src/share/ctypedef/../../tools/tools/locale/etc/final-maps/widths.txt -f /workspace/src/share/ctypedef/../../tools/tools/locale/etc/final-maps/map.GB18030 -i /workspace/src/share/ctypedef/zh_CN.eucCN.src /tmp/obj/workspace/src/amd64.amd64/share/ctypedef/zh_CN.GB18030
--- all_subdir_rescue ---
--- ps.o ---
/usr/local/bin/x86_64-unknown-freebsd14.4-gcc14 --sysroot=/tmp/obj/workspace/src/amd64.amd64/tmp -B/usr/local/x86_64-unknown-freebsd14.4/bin/ -O2 -pipe -fno-common -DLAZY_PS -DRESCUE -I/tmp/obj/workspace/src/amd64.amd64/lib/libifconfig -I/tmp/obj/workspace/src/amd64.amd64/lib/libiscsiutil -ffile-prefix-map=/workspace/src=/usr/src -ffile-prefix-map=/tmp/obj/workspace/src/amd64.amd64/rescue/rescue/workspace/src=/usr/obj -g -MD -MF.depend.ps.o -MTps.o -std=gnu99 -Wno-format-zero-length -fstack-protector-strong -Wsystem-headers -Werror -Wall -Wno-format-y2k -W -Wno-unused-parameter -Wmissing-prototypes -Wpointer-arith -Wreturn-type -Wcast-qual -Wwrite-strings -Wswitch -Wshadow -Wunused-parameter -Wcast-align -Wchar-subscripts -Wnested-externs -Wold-style-definition -Wno-pointer-sign -Wdate-time -Wno-error=address -Wno-error=array-bounds -Wno-error=attributes -Wno-error=bool-compare -Wno-error=cast-align -Wno-error=clobbered -Wno-error=deprecated-declarations -Wno-error=enum-compare -Wno-error=extra -Wno-error=logical-not-parentheses -Wno-error=strict-aliasing -Wno-error=uninitialized -Wno-error=unused-function -Wno-error=unused-value -Wno-error=empty-body -Wno-error=maybe-uninitialized -Wno-error=nonnull-compare -Wno-error=shift-negative-value -Wno-error=tautological-compare -Wno-error=unused-const-variable -Wno-error=bool-operation -Wno-error=deprecated -Wno-error=expansion-to-defined -Wno-error=format-overflow -Wno-error=format-truncation -Wno-error=implicit-fallthrough -Wno-error=int-in-bool-context -Wno-error=memset-elt-size -Wno-error=noexcept-type -Wno-error=nonnull -Wno-error=pointer-compare -Wno-error=stringop-overflow -Wno-error=aggressive-loop-optimizations -Wno-error=cast-function-type -Wno-error=catch-value -Wno-error=multistatement-macros -Wno-error=restrict -Wno-error=sizeof-pointer-memaccess -Wno-error=stringop-truncation -Wno-return-type -c /workspace/src/bin/ps/ps.c -o ps.o
--- all_subdir_kerberos5 ---
--- server.pieo ---
/usr/local/bin/x86_64-unknown-freebsd14.4-gcc14 --sysroot=/tmp/obj/workspace/src/amd64.amd64/tmp -B/usr/local/x86_64-unknown-freebsd14.4/bin/ -fpie -DPIC -O2 -pipe -fno-common -I/workspace/src/crypto/heimdal/lib/krb5 -I/workspace/src/crypto/heimdal/lib/asn1 -I/workspace/src/crypto/heimdal/lib/roken -I/workspace/src/contrib/com_err -DHAVE_CONFIG_H -I/workspace/src/kerberos5/include -fPIE -ffile-prefix-map=/workspace/src=/usr/src -ffile-prefix-map=/tmp/obj/workspace/src=/usr/obj -g -MD -MF.depend.server.pieo -MTserver.pieo -std=gnu99 -Wno-format-zero-length -fstack-protector-strong -Wsystem-headers -Werror -Wno-pointer-sign -Wdate-time -Wno-error=address -Wno-error=array-bounds -Wno-error=attributes -Wno-error=bool-compare -Wno-error=cast-align -Wno-error=clobbered -Wno-error=deprecated-declarations -Wno-error=enum-compare -Wno-error=extra -Wno-error=logical-not-parentheses -Wno-error=strict-aliasing -Wno-error=uninitialized -Wno-error=unused-function -Wno-error=unused-value -Wno-error=empty-body -Wno-error=maybe-uninitialized -Wno-error=nonnull-compare -Wno-error=shift-negative-value -Wno-error=tautological-compare -Wno-error=unused-const-variable -Wno-error=bool-operation -Wno-error=deprecated -Wno-error=expansion-to-defined -Wno-error=format-overflow -Wno-error=format-truncation -Wno-error=implicit-fallthrough -Wno-error=int-in-bool-context -Wno-error=memset-elt-size -Wno-error=noexcept-type -Wno-error=nonnull -Wno-error=pointer-compare -Wno-error=stringop-overflow -Wno-error=aggressive-loop-optimizations -Wno-error=cast-function-type -Wno-error=catch-value -Wno-error=multistatement-macros -Wno-error=restrict -Wno-error=sizeof-pointer-memaccess -Wno-error=stringop-truncation -Wno-return-type -Wno-address-of-packed-member -c /workspace/src/crypto/heimdal/kadmin/server.c -o server.pieo
--- all_subdir_sbin ---
--- tree.pieo ---
/usr/local/bin/x86_64-unknown-freebsd14.4-gcc14 --sysroot=/tmp/obj/workspace/src/amd64.amd64/tmp -B/usr/local/x86_64-unknown-freebsd14.4/bin/ -fpie -DPIC -O2 -pipe -fno-common -DWITH_CASPER -fPIE -ffile-prefix-map=/workspace/src=/usr/src -ffile-prefix-map=/tmp/obj/workspace/src=/usr/obj -g -MD -MF.depend.tree.pieo -MTtree.pieo -std=gnu99 -Wno-format-zero-length -fstack-protector-strong -Wsystem-headers -Werror -Wall -Wno-format-y2k -W -Wno-unused-parameter -Wmissing-prototypes -Wpointer-arith -Wreturn-type -Wcast-qual -Wwrite-strings -Wswitch -Wshadow -Wunused-parameter -Wchar-subscripts -Wnested-externs -Wold-style-definition -Wno-pointer-sign -Wdate-time -Wno-error=address -Wno-error=array-bounds -Wno-error=attributes -Wno-error=bool-compare -Wno-error=cast-align -Wno-error=clobbered -Wno-error=deprecated-declarations -Wno-error=enum-compare -Wno-error=extra -Wno-error=logical-not-parentheses -Wno-error=strict-aliasing -Wno-error=uninitialized -Wno-error=unused-function -Wno-error=unused-value -Wno-error=empty-body -Wno-error=maybe-uninitialized -Wno-error=nonnull-compare -Wno-error=shift-negative-value -Wno-error=tautological-compare -Wno-error=unused-const-variable -Wno-error=bool-operation -Wno-error=deprecated -Wno-error=expansion-to-defined -Wno-error=format-overflow -Wno-error=format-truncation -Wno-error=implicit-fallthrough -Wno-error=int-in-bool-context -Wno-error=memset-elt-size -Wno-error=noexcept-type -Wno-error=nonnull -Wno-error=pointer-compare -Wno-error=stringop-overflow -Wno-error=aggressive-loop-optimizations -Wno-error=cast-function-type -Wno-error=catch-value -Wno-error=multistatement-macros -Wno-error=restrict -Wno-error=sizeof-pointer-memaccess -Wno-error=stringop-truncation -Wno-return-type -c /workspace/src/sbin/dhclient/tree.c -o tree.pieo
--- all_subdir_share ---
--- zh_TW.Big5.LC_CTYPE ---
localedef -l -D -U -c -w /workspace/src/share/ctypedef/../../tools/tools/locale/etc/final-maps/widths.txt -f /workspace/src/share/ctypedef/../../tools/tools/locale/etc/final-maps/map.Big5 -i /workspace/src/share/ctypedef/zh_TW.Big5.src /tmp/obj/workspace/src/amd64.amd64/share/ctypedef/zh_TW.Big5
--- all_subdir_rescue ---
/workspace/src/bin/ps/ps.c:45:19: warning: 'copyright' defined but not used [-Wunused-const-variable=]
45 | static const char copyright[] =
| ^~~~~~~~~
--- all_subdir_sbin ---
--- conflex.pieo ---
/usr/local/bin/x86_64-unknown-freebsd14.4-gcc14 --sysroot=/tmp/obj/workspace/src/amd64.amd64/tmp -B/usr/local/x86_64-unknown-freebsd14.4/bin/ -fpie -DPIC -O2 -pipe -fno-common -DWITH_CASPER -fPIE -ffile-prefix-map=/workspace/src=/usr/src -ffile-prefix-map=/tmp/obj/workspace/src=/usr/obj -g -MD -MF.depend.conflex.pieo -MTconflex.pieo -std=gnu99 -Wno-format-zero-length -fstack-protector-strong -Wsystem-headers -Werror -Wall -Wno-format-y2k -W -Wno-unused-parameter -Wmissing-prototypes -Wpointer-arith -Wreturn-type -Wcast-qual -Wwrite-strings -Wswitch -Wshadow -Wunused-parameter -Wchar-subscripts -Wnested-externs -Wold-style-definition -Wno-pointer-sign -Wdate-time -Wno-error=address -Wno-error=array-bounds -Wno-error=attributes -Wno-error=bool-compare -Wno-error=cast-align -Wno-error=clobbered -Wno-error=deprecated-declarations -Wno-error=enum-compare -Wno-error=extra -Wno-error=logical-not-parentheses -Wno-error=strict-aliasing -Wno-error=uninitialized -Wno-error=unused-function -Wno-error=unused-value -Wno-error=empty-body -Wno-error=maybe-uninitialized -Wno-error=nonnull-compare -Wno-error=shift-negative-value -Wno-error=tautological-compare -Wno-error=unused-const-variable -Wno-error=bool-operation -Wno-error=deprecated -Wno-error=expansion-to-defined -Wno-error=format-overflow -Wno-error=format-truncation -Wno-error=implicit-fallthrough -Wno-error=int-in-bool-context -Wno-error=memset-elt-size -Wno-error=noexcept-type -Wno-error=nonnull -Wno-error=pointer-compare -Wno-error=stringop-overflow -Wno-error=aggressive-loop-optimizations -Wno-error=cast-function-type -Wno-error=catch-value -Wno-error=multistatement-macros -Wno-error=restrict -Wno-error=sizeof-pointer-memaccess -Wno-error=stringop-truncation -Wno-return-type -c /workspace/src/sbin/dhclient/conflex.c -o conflex.pieo
--- all_subdir_cddl ---
--- output.pieo ---
/usr/local/bin/x86_64-unknown-freebsd14.4-gcc14 --sysroot=/tmp/obj/workspace/src/amd64.amd64/tmp -B/usr/local/x86_64-unknown-freebsd14.4/bin/ -fpie -DPIC -O2 -pipe -fno-common -DIN_BASE -I/workspace/src/sys/contrib/openzfs/include -I/workspace/src/sys/contrib/openzfs/lib/libspl/include/ -I/workspace/src/sys/contrib/openzfs/lib/libspl/include/os/freebsd -I/workspace/src/cddl/compat/opensolaris/include -I/workspace/src/sys/cddl/compat/opensolaris -I/workspace/src/cddl/compat/opensolaris/include -I/workspace/src/cddl/usr.bin/ctfconvert/../../../cddl/contrib/opensolaris -I/workspace/src/cddl/usr.bin/ctfconvert/../../../sys/cddl/contrib/opensolaris -I/workspace/src/cddl/usr.bin/ctfconvert/../../../cddl/contrib/opensolaris/head -I/workspace/src/cddl/usr.bin/ctfconvert/../../../cddl/contrib/opensolaris/tools/ctf/common -I/workspace/src/cddl/usr.bin/ctfconvert/../../../cddl/contrib/opensolaris/tools/ctf/cvt -I/workspace/src/cddl/usr.bin/ctfconvert/../../../sys/cddl/contrib/opensolaris/uts/common -DHAVE_ISSETUGID -DNEED_SOLARIS_BOOLEAN -fPIE -ffile-prefix-map=/workspace/src=/usr/src -ffile-prefix-map=/tmp/obj/workspace/src=/usr/obj -g -MD -MF.depend.output.pieo -MToutput.pieo -std=gnu99 -Wno-format-zero-length -fstack-protector-strong -Wsystem-headers -Werror -Wall -Wno-format-y2k -W -Wno-unused-parameter -Wmissing-prototypes -Wpointer-arith -Wreturn-type -Wcast-qual -Wwrite-strings -Wswitch -Wshadow -Wunused-parameter -Wcast-align -Wchar-subscripts -Wnested-externs -Wold-style-definition -Wno-pointer-sign -Wdate-time -Wno-error=address -Wno-error=array-bounds -Wno-error=attributes -Wno-error=bool-compare -Wno-error=cast-align -Wno-error=clobbered -Wno-error=deprecated-declarations -Wno-error=enum-compare -Wno-error=extra -Wno-error=logical-not-parentheses -Wno-error=strict-aliasing -Wno-error=uninitialized -Wno-error=unused-function -Wno-error=unused-value -Wno-error=empty-body -Wno-error=maybe-uninitialized -Wno-error=nonnull-compare -Wno-error=shift-negative-value -Wno-error=tautological-compare -Wno-error=unused-const-variable -Wno-error=bool-operation -Wno-error=deprecated -Wno-error=expansion-to-defined -Wno-error=format-overflow -Wno-error=format-truncation -Wno-error=implicit-fallthrough -Wno-error=int-in-bool-context -Wno-error=memset-elt-size -Wno-error=noexcept-type -Wno-error=nonnull -Wno-error=pointer-compare -Wno-error=stringop-overflow -Wno-error=aggressive-loop-optimizations -Wno-error=cast-function-type -Wno-error=catch-value -Wno-error=multistatement-macros -Wno-error=restrict -Wno-error=sizeof-pointer-memaccess -Wno-error=stringop-truncation -Wno-return-type -Wno-unknown-pragmas -c /workspace/src/cddl/contrib/opensolaris/tools/ctf/cvt/output.c -o output.pieo
--- all_subdir_secure ---
--- sftp-server-main.pieo ---
/usr/local/bin/x86_64-unknown-freebsd14.4-gcc14 --sysroot=/tmp/obj/workspace/src/amd64.amd64/tmp -B/usr/local/x86_64-unknown-freebsd14.4/bin/ -fpie -DPIC -O2 -pipe -fno-common -I/workspace/src/crypto/openssh -include ssh_namespace.h -include krb5_config.h -DXAUTH_PATH=\"/usr/local/bin/xauth\" -DHAVE_LDNS=1 -DLIBWRAP=1 -include sk_config.h -DOPENSSL_API_COMPAT=0x10100000L -fPIE -ffile-prefix-map=/workspace/src=/usr/src -ffile-prefix-map=/tmp/obj/workspace/src=/usr/obj -g -MD -MF.depend.sftp-server-main.pieo -MTsftp-server-main.pieo -std=gnu99 -Wno-format-zero-length -fstack-protector-strong -Wno-pointer-sign -Wdate-time -Wno-error=address -Wno-error=array-bounds -Wno-error=attributes -Wno-error=bool-compare -Wno-error=cast-align -Wno-error=clobbered -Wno-error=deprecated-declarations -Wno-error=enum-compare -Wno-error=extra -Wno-error=logical-not-parentheses -Wno-error=strict-aliasing -Wno-error=uninitialized -Wno-error=unused-function -Wno-error=unused-value -Wno-error=empty-body -Wno-error=maybe-uninitialized -Wno-error=nonnull-compare -Wno-error=shift-negative-value -Wno-error=tautological-compare -Wno-error=unused-const-variable -Wno-error=bool-operation -Wno-error=deprecated -Wno-error=expansion-to-defined -Wno-error=format-overflow -Wno-error=format-truncation -Wno-error=implicit-fallthrough -Wno-error=int-in-bool-context -Wno-error=memset-elt-size -Wno-error=noexcept-type -Wno-error=nonnull -Wno-error=pointer-compare -Wno-error=stringop-overflow -Wno-error=aggressive-loop-optimizations -Wno-error=cast-function-type -Wno-error=catch-value -Wno-error=multistatement-macros -Wno-error=restrict -Wno-error=sizeof-pointer-memaccess -Wno-error=stringop-truncation -Wno-return-type -Wno-address-of-packed-member -c /workspace/src/crypto/openssh/sftp-server-main.c -o sftp-server-main.pieo
--- all_subdir_lib ---
--- cexp_test.full ---
/usr/local/bin/x86_64-unknown-freebsd14.4-gcc14 --sysroot=/tmp/obj/workspace/src/amd64.amd64/tmp -B/usr/local/x86_64-unknown-freebsd14.4/bin/ -O2 -pipe -fno-common -DHAVE_FENV_H -I/workspace/src/contrib/netbsd-tests/lib/libc/gen -D__HAVE_LONG_DOUBLE -fno-builtin -DLDBL_PREC=64 -fPIE -ffile-prefix-map=/workspace/src=/usr/src -ffile-prefix-map=/tmp/obj/workspace/src=/usr/obj -g -std=gnu99 -Wno-format-zero-length -fstack-protector-strong -Wsystem-headers -Werror -Wall -Wno-format-y2k -W -Wno-unused-parameter -Wmissing-prototypes -Wpointer-arith -Wreturn-type -Wcast-qual -Wwrite-strings -Wswitch -Wshadow -Wunused-parameter -Wcast-align -Wchar-subscripts -Wnested-externs -Wold-style-definition -Wno-pointer-sign -Wdate-time -Wno-error=address -Wno-error=array-bounds -Wno-error=attributes -Wno-error=bool-compare -Wno-error=cast-align -Wno-error=clobbered -Wno-error=deprecated-declarations -Wno-error=enum-compare -Wno-error=extra -Wno-error=logical-not-parentheses -Wno-error=strict-aliasing -Wno-error=uninitialized -Wno-error=unused-function -Wno-error=unused-value -Wno-error=empty-body -Wno-error=maybe-uninitialized -Wno-error=nonnull-compare -Wno-error=shift-negative-value -Wno-error=tautological-compare -Wno-error=unused-const-variable -Wno-error=bool-operation -Wno-error=deprecated -Wno-error=expansion-to-defined -Wno-error=format-overflow -Wno-error=format-truncation -Wno-error=implicit-fallthrough -Wno-error=int-in-bool-context -Wno-error=memset-elt-size -Wno-error=noexcept-type -Wno-error=nonnull -Wno-error=pointer-compare -Wno-error=stringop-overflow -Wno-error=aggressive-loop-optimizations -Wno-error=cast-function-type -Wno-error=catch-value -Wno-error=multistatement-macros -Wno-error=restrict -Wno-error=sizeof-pointer-memaccess -Wno-error=stringop-truncation -Wno-return-type -Wno-unknown-pragmas -Wl,-zrelro -pie -Wl,-znoexecstack -o cexp_test.full cexp_test.pieo -lprivateatf-c -lm
--- all_subdir_share ---
--- C.UTF-8.LC_CTYPE ---
localedef -l -D -U -c -w /workspace/src/share/ctypedef/../../tools/tools/locale/etc/final-maps/widths.txt -f /workspace/src/share/ctypedef/../../tools/tools/locale/etc/final-maps/map.UTF-8 -i /workspace/src/share/ctypedef/C.UTF-8.src /tmp/obj/workspace/src/amd64.amd64/share/ctypedef/C.UTF-8
--- all_subdir_lib ---
--- cexp_test.debug ---
/usr/local/x86_64-unknown-freebsd14.4/bin/objcopy --only-keep-debug cexp_test.full cexp_test.debug
--- cexp_test ---
/usr/local/x86_64-unknown-freebsd14.4/bin/objcopy --strip-debug --add-gnu-debuglink=cexp_test.debug cexp_test.full cexp_test
--- all_subdir_secure ---
--- sftp-server.full ---
--- all_subdir_lib ---
--- conj_test ---
--- all_subdir_secure ---
/usr/local/bin/x86_64-unknown-freebsd14.4-gcc14 --sysroot=/tmp/obj/workspace/src/amd64.amd64/tmp -B/usr/local/x86_64-unknown-freebsd14.4/bin/ -O2 -pipe -fno-common -I/workspace/src/crypto/openssh -include ssh_namespace.h -include krb5_config.h -DXAUTH_PATH=\"/usr/local/bin/xauth\" -DHAVE_LDNS=1 -DLIBWRAP=1 -include sk_config.h -DOPENSSL_API_COMPAT=0x10100000L -fPIE -ffile-prefix-map=/workspace/src=/usr/src -ffile-prefix-map=/tmp/obj/workspace/src=/usr/obj -g -std=gnu99 -Wno-format-zero-length -fstack-protector-strong -Wno-pointer-sign -Wdate-time -Wno-error=address -Wno-error=array-bounds -Wno-error=attributes -Wno-error=bool-compare -Wno-error=cast-align -Wno-error=clobbered -Wno-error=deprecated-declarations -Wno-error=enum-compare -Wno-error=extra -Wno-error=logical-not-parentheses -Wno-error=strict-aliasing -Wno-error=uninitialized -Wno-error=unused-function -Wno-error=unused-value -Wno-error=empty-body -Wno-error=maybe-uninitialized -Wno-error=nonnull-compare -Wno-error=shift-negative-value -Wno-error=tautological-compare -Wno-error=unused-const-variable -Wno-error=bool-operation -Wno-error=deprecated -Wno-error=expansion-to-defined -Wno-error=format-overflow -Wno-error=format-truncation -Wno-error=implicit-fallthrough -Wno-error=int-in-bool-context -Wno-error=memset-elt-size -Wno-error=noexcept-type -Wno-error=nonnull -Wno-error=pointer-compare -Wno-error=stringop-overflow -Wno-error=aggressive-loop-optimizations -Wno-error=cast-function-type -Wno-error=catch-value -Wno-error=multistatement-macros -Wno-error=restrict -Wno-error=sizeof-pointer-memaccess -Wno-error=stringop-truncation -Wno-return-type -Wno-address-of-packed-member -Wl,-zrelro -pie -Wl,-znoexecstack -o sftp-server.full sftp-common.pieo sftp-server.pieo sftp-server-main.pieo -lprivatessh
--- all_subdir_libexec ---
--- all_subdir_libexec/atf/atf-sh/tests ---
===> libexec/atf/atf-sh/tests (all)
--- all_subdir_lib ---
(cd /workspace/src/lib/msun/tests && DEPENDFILE=.depend.conj_test NO_SUBDIR=1 make -f /workspace/src/lib/msun/tests/Makefile _RECURSING_PROGS=t PROG=conj_test )
--- .depend.conj_test ---
echo conj_test.full: /tmp/obj/workspace/src/amd64.amd64/tmp/usr/lib/libc.a /tmp/obj/workspace/src/amd64.amd64/tmp/usr/lib/libprivateatf-c.a /tmp/obj/workspace/src/amd64.amd64/tmp/usr/lib/libm.a >> .depend.conj_test
--- conj_test.pieo ---
/usr/local/bin/x86_64-unknown-freebsd14.4-gcc14 --sysroot=/tmp/obj/workspace/src/amd64.amd64/tmp -B/usr/local/x86_64-unknown-freebsd14.4/bin/ -fpie -DPIC -O2 -pipe -fno-common -DHAVE_FENV_H -I/workspace/src/contrib/netbsd-tests/lib/libc/gen -D__HAVE_LONG_DOUBLE -fno-builtin -DLDBL_PREC=64 -fPIE -ffile-prefix-map=/workspace/src=/usr/src -ffile-prefix-map=/tmp/obj/workspace/src=/usr/obj -g -MD -MF.depend.conj_test.conj_test.pieo -MTconj_test.pieo -std=gnu99 -Wno-format-zero-length -fstack-protector-strong -Wsystem-headers -Werror -Wall -Wno-format-y2k -W -Wno-unused-parameter -Wmissing-prototypes -Wpointer-arith -Wreturn-type -Wcast-qual -Wwrite-strings -Wswitch -Wshadow -Wunused-parameter -Wcast-align -Wchar-subscripts -Wnested-externs -Wold-style-definition -Wno-pointer-sign -Wdate-time -Wno-error=address -Wno-error=array-bounds -Wno-error=attributes -Wno-error=bool-compare -Wno-error=cast-align -Wno-error=clobbered -Wno-error=deprecated-declarations -Wno-error=enum-compare -Wno-error=extra -Wno-error=logical-not-parentheses -Wno-error=strict-aliasing -Wno-error=uninitialized -Wno-error=unused-function -Wno-error=unused-value -Wno-error=empty-body -Wno-error=maybe-uninitialized -Wno-error=nonnull-compare -Wno-error=shift-negative-value -Wno-error=tautological-compare -Wno-error=unused-const-variable -Wno-error=bool-operation -Wno-error=deprecated -Wno-error=expansion-to-defined -Wno-error=format-overflow -Wno-error=format-truncation -Wno-error=implicit-fallthrough -Wno-error=int-in-bool-context -Wno-error=memset-elt-size -Wno-error=noexcept-type -Wno-error=nonnull -Wno-error=pointer-compare -Wno-error=stringop-overflow -Wno-error=aggressive-loop-optimizations -Wno-error=cast-function-type -Wno-error=catch-value -Wno-error=multistatement-macros -Wno-error=restrict -Wno-error=sizeof-pointer-memaccess -Wno-error=stringop-truncation -Wno-return-type -Wno-unknown-pragmas -c /workspace/src/lib/msun/tests/conj_test.c -o conj_test.pieo
--- all_subdir_libexec ---
--- Kyuafile ---
--- misc_helpers ---
echo '#! /usr/libexec/atf-sh' >misc_helpers.tmp
cat /workspace/src/contrib/atf/atf-sh/misc_helpers.sh >>misc_helpers.tmp
chmod +x misc_helpers.tmp
mv misc_helpers.tmp misc_helpers
--- atf_check_test ---
echo '#! /usr/libexec/atf-sh' > atf_check_test.tmp
cat /workspace/src/contrib/atf/atf-sh/atf_check_test.sh >>atf_check_test.tmp
chmod +x atf_check_test.tmp
mv atf_check_test.tmp atf_check_test
--- config_test ---
echo '#! /usr/libexec/atf-sh' > config_test.tmp
cat /workspace/src/contrib/atf/atf-sh/config_test.sh >>config_test.tmp
chmod +x config_test.tmp
mv config_test.tmp config_test
--- integration_test ---
echo '#! /usr/libexec/atf-sh' > integration_test.tmp
cat /workspace/src/contrib/atf/atf-sh/integration_test.sh | sed -e 's,__ATF_SH__,/usr/libexec/atf-sh,g' >>integration_test.tmp
--- all_subdir_share ---
--- all_subdir_share/colldef_unicode ---
--- lt_LT.UTF-8.LC_COLLATE ---
--- all_subdir_libexec ---
chmod +x integration_test.tmp
--- all_subdir_share ---
localedef -l -D -U -i /workspace/src/share/colldef_unicode/lt_LT.UTF-8.src -V "43.0" -f /workspace/src/share/colldef_unicode/../../tools/tools/locale/etc/final-maps/map.UTF-8 /tmp/obj/workspace/src/amd64.amd64/share/colldef_unicode/lt_LT.UTF-8
--- all_subdir_libexec ---
mv integration_test.tmp integration_test
--- normalize_test ---
echo '#! /usr/libexec/atf-sh' > normalize_test.tmp
cat /workspace/src/contrib/atf/atf-sh/normalize_test.sh >>normalize_test.tmp
chmod +x normalize_test.tmp
mv normalize_test.tmp normalize_test
--- tc_test ---
echo '#! /usr/libexec/atf-sh' > tc_test.tmp
cat /workspace/src/contrib/atf/atf-sh/tc_test.sh >>tc_test.tmp
chmod +x tc_test.tmp
mv tc_test.tmp tc_test
--- tp_test ---
echo '#! /usr/libexec/atf-sh' > tp_test.tmp
cat /workspace/src/contrib/atf/atf-sh/tp_test.sh >>tp_test.tmp
chmod +x tp_test.tmp
mv tp_test.tmp tp_test
--- atf-sh.full ---
/usr/local/bin/x86_64-unknown-freebsd14.4-g++14 --sysroot=/tmp/obj/workspace/src/amd64.amd64/tmp -B/usr/local/x86_64-unknown-freebsd14.4/bin/ -O2 -pipe -fno-common -DHAVE_CONFIG_H -DHAVE_CONFIG_H -DATF_LIBEXECDIR='"/usr/libexec"' -DATF_PKGDATADIR='"/usr/share/atf"' -DATF_SHELL='"/bin/sh"' -I/workspace/src/contrib/atf -fPIE -ffile-prefix-map=/workspace/src=/usr/src -ffile-prefix-map=/tmp/obj/workspace/src=/usr/obj -g -Wno-format-zero-length -fstack-protector-strong -Wsystem-headers -Werror -Wall -Wno-format-y2k -W -Wno-unused-parameter -Wpointer-arith -Wno-uninitialized -Wdate-time -Wformat=2 -Wno-format-extra-args -Werror -Wno-error=address -Wno-error=array-bounds -Wno-error=attributes -Wno-error=bool-compare -Wno-error=cast-align -Wno-error=clobbered -Wno-error=deprecated-declarations -Wno-error=enum-compare -Wno-error=extra -Wno-error=logical-not-parentheses -Wno-error=strict-aliasing -Wno-error=uninitialized -Wno-error=unused-function -Wno-error=unused-value -Wno-error=empty-body -Wno-error=maybe-uninitialized -Wno-error=nonnull-compare -Wno-error=shift-negative-value -Wno-error=tautological-compare -Wno-error=unused-const-variable -Wno-error=bool-operation -Wno-error=deprecated -Wno-error=expansion-to-defined -Wno-error=format-overflow -Wno-error=format-truncation -Wno-error=implicit-fallthrough -Wno-error=int-in-bool-context -Wno-error=memset-elt-size -Wno-error=noexcept-type -Wno-error=nonnull -Wno-error=pointer-compare -Wno-error=stringop-overflow -Wno-error=aggressive-loop-optimizations -Wno-error=cast-function-type -Wno-error=catch-value -Wno-error=multistatement-macros -Wno-error=restrict -Wno-error=sizeof-pointer-memaccess -Wno-error=stringop-truncation -Wno-return-type -Wno-address-of-packed-member -fPIE -ffile-prefix-map=/workspace/src=/usr/src -ffile-prefix-map=/tmp/obj/workspace/src=/usr/obj -g -Wno-error=class-memaccess -Wno-literal-suffix -Wno-c++14-extensions -Wno-c++17-extensions -Wno-c++20-extensions -Wno-error=unknown-pragmas -Wno-dangling-reference -Wl,-zrelro -pie -Wl,-znoexecstack -o atf-sh.full atf-sh.pieo -lprivateatf-c++ -lprivateatf-c
--- all_subdir_secure ---
/usr/local/bin/x86_64-unknown-freebsd14.4-ld: /tmp/obj/workspace/src/amd64.amd64/tmp/usr/lib/libprivatessh.so: undefined reference to `Fssh_sshsk_sign'
collect2: error: ld returned 1 exit status
*** [sftp-server.full] Error code 1
make[5]: stopped making "all" in /workspace/src/secure/libexec/sftp-server
make[5]: 1 error
make[5]: stopped making "all" in /workspace/src/secure/libexec/sftp-server
make[4]: stopped making "all" in /workspace/src/secure/libexec
make[3]: stopped making "all" in /workspace/src/secure
make[2]: stopped making "all" in /workspace/src
--- all_subdir_libexec ---
make[4]: stopped making "all" in /workspace/src/libexec/atf
make[3]: stopped making "all" in /workspace/src/libexec
make[2]: stopped making "all" in /workspace/src
--- all_subdir_sbin ---
make[3]: stopped making "all" in /workspace/src/sbin
make[2]: stopped making "all" in /workspace/src
--- all_subdir_kerberos5 ---
make[4]: stopped making "all" in /workspace/src/kerberos5/libexec
make[3]: stopped making "all" in /workspace/src/kerberos5
make[2]: stopped making "all" in /workspace/src
--- all_subdir_cddl ---
make[4]: stopped making "all" in /workspace/src/cddl/usr.bin
make[3]: stopped making "all" in /workspace/src/cddl
make[2]: stopped making "all" in /workspace/src
--- all_subdir_bin ---
make[3]: stopped making "all" in /workspace/src/bin
make[2]: stopped making "all" in /workspace/src
--- all_subdir_lib ---
make[5]: stopped making "all" in /workspace/src/lib/msun/tests
make[4]: stopped making "all" in /workspace/src/lib/msun
make[3]: stopped making "all" in /workspace/src/lib
make[2]: stopped making "all" in /workspace/src
--- all_subdir_rescue ---
make[5]: stopped making "objs" in /tmp/obj/workspace/src/amd64.amd64/rescue/rescue
*** [objs] Error code 2
make[4]: stopped making "all" in /workspace/src/rescue/rescue
make[4]: 1 error
make[4]: stopped making "all" in /workspace/src/rescue/rescue
make[3]: stopped making "all" in /workspace/src/rescue
make[2]: stopped making "all" in /workspace/src
--- all_subdir_share ---
make[3]: stopped making "all" in /workspace/src/share
--- all_subdir_stand ---
--- all_subdir_stand/libsa ---
make[3]: stopped making "all" in /workspace/src/stand
--- all_subdir_share ---
--- all_subdir_share/ctypedef ---
make[3]: stopped making "all" in /workspace/src/share
make[2]: stopped making "all" in /workspace/src
--- all_subdir_stand ---
--- all_subdir_stand/libsa32 ---
make[3]: stopped making "all" in /workspace/src/stand
make[2]: stopped making "all" in /workspace/src
20.09 real 174.00 user 19.37 sys
make[1]: stopped making "buildworld" in /workspace/src
make: stopped making "buildworld" in /workspace/src
Build step 'Execute shell' marked build as failure
[PostBuildScript] - [INFO] Executing post build scripts.
[FreeBSD-stable-14-amd64-gcc14_build] $ /bin/sh -xe /tmp/jenkins2867531731961360671.sh
+ sh freebsd-ci/scripts/jail/clean.sh
clean jail FreeBSD-stable-14-amd64-gcc14_build
Checking for post-build
Performing post-build step
Checking if email needs to be generated
Email was triggered for: Failure - Any
Sending email for trigger: Failure - Any
Sending mail from default account using System Admin e-mail address