FreeBSD-main-amd64-test - Build #29662 - Still Unstable

From: <jenkins-admin_at_FreeBSD.org>
Date: Sat, 10 Oct 2026 09:58:00 UTC
FreeBSD-main-amd64-test - Build #29662 (aa4086951b4a26386bcdcd0693520e7d35be425e) - Still Unstable

Build information: https://ci.FreeBSD.org/job/FreeBSD-main-amd64-test/29662/
Full change log: https://ci.FreeBSD.org/job/FreeBSD-main-amd64-test/29662/changes
Full build log: https://ci.FreeBSD.org/job/FreeBSD-main-amd64-test/29662/console

Status explanation:
"Unstable" - some tests are suspected being broken by the following changes
"Still Unstable" - the failing test cases have not been fixed by these
                   following changes and this is a notification to note that
                   these changes have not been fully tested by the CI system

Change summaries:
(Those commits are likely but not certainly responsible)

3864fe9317325e6abddf7b7126873918533231f8 by andrew:
arm64: Add a header for system instructions

e8997a4e44c7729e6013745cb6590d2ec3691175 by andrew:
arm64: Use sysinsn.h to generate tlbi instructions

6bf6fe1d70e780786a07e759d75eeb256f247fcd by andrew:
arm64: Fix the MPIDR_EL1 field names

7081201eb07367be73e43c5f878dfec51e8fe0d7 by andrew:
arm64/vmm: vgic_v3: Set EOI for level-triggered interrupts

aa4086951b4a26386bcdcd0693520e7d35be425e by andrew:
arm64/vmm: vgic_v3: Fix missing free of vgic_cpu->private_irqs



The failed test cases:

9 tests failed.
FAILED:  sys.netpfil.pf.pfsync.bulk

Error Message:
state not found on synced host

FAILED:  sys.netpfil.pf.syncookie.basic_v6

Error Message:
Failed to connect to syncookie protected echo daemon

FAILED:  sys.kern.ssl_sendfile.eagain_vs_eof

Error Message:
/usr/src/tests/sys/kern/ssl_sendfile.c:485: c.sbytes == -1 not met

FAILED:  sys.kern.ssl_sendfile.grow

Error Message:
Test case body timed out

FAILED:  sys.kern.ssl_sendfile.truncate

Error Message:
Test case body timed out

FAILED:  lib.libexecinfo.sigtramp_test.test_backtrace_sigtramp

Error Message:
/usr/src/lib/libexecinfo/tests/sigtramp_test.c:30: n > 1 not met

FAILED:  sys.net.if_lagg_test.witness

Error Message:
Lock-order reversals involving if_lagg.c detected

FAILED:  sys.netinet.udp_bindings.connect_bound_socket_from_2address_jail

Error Message:
/usr/src/tests/sys/netinet/udp_bindings.c:244: connect(s, (struct sockaddr *)&sin, sizeof(sin)) == 0 not met

FAILED:  sys.netlink.netlink_socket.overflow

Error Message:
/usr/src/tests/sys/netlink/netlink_socket.c:146: send(fd, &hdr, sizeof(hdr), 0) == sizeof(hdr) not met