FreeBSD-stable-15-amd64-test - Build #1159 - Still Unstable
Date: Sat, 10 Oct 2026 01:43:16 UTC
FreeBSD-stable-15-amd64-test - Build #1159 (7ed9a5a696c302ca37c3dd500ea4fbbf9c581a3e) - Still Unstable
Build information: https://ci.FreeBSD.org/job/FreeBSD-stable-15-amd64-test/1159/
Full change log: https://ci.FreeBSD.org/job/FreeBSD-stable-15-amd64-test/1159/changes
Full build log: https://ci.FreeBSD.org/job/FreeBSD-stable-15-amd64-test/1159/console
Status explanation:
"Unstable" - some tests are suspected being broken by the following changes
"Still Unstable" - the failing test cases have not been fixed by these
following changes and this is a notification to note that
these changes have not been fully tested by the CI system
Change summaries:
(Those commits are likely but not certainly responsible)
21f25cc80de2f9f35d7698bf355b0353da45dbc7 by delphij:
libcasper: tolerate kernels without PD_NOWAITPID
8c47cbc97a17dbf0ce55aff65546f54fdf9a0a7e by aokblast:
hexdump: Support octal and hex for -N option
7ed9a5a696c302ca37c3dd500ea4fbbf9c581a3e by aokblast:
linux: Exposes renderD nodes and chardev in sysfs
The failed test cases:
3 tests failed.
FAILED: sys.fs.fusefs.ext2-misc.execute
Error Message:
atf-check failed; see the output of the test for details
FAILED: sys.netpfil.pf.pfsync.bulk
Error Message:
state not found on synced host
FAILED: lib.libexecinfo.sigtramp_test.test_backtrace_sigtramp
Error Message:
/usr/src/lib/libexecinfo/tests/sigtramp_test.c:30: n > 1 not met