FreeBSD-main-amd64-test - Build #29654 - Still Unstable
Date: Fri, 09 Oct 2026 12:07:39 UTC
FreeBSD-main-amd64-test - Build #29654 (cb3d3e5bb0c6bbb1f6ef3efe67e7a6e71bc20f0b) - Still Unstable
Build information: https://ci.FreeBSD.org/job/FreeBSD-main-amd64-test/29654/
Full change log: https://ci.FreeBSD.org/job/FreeBSD-main-amd64-test/29654/changes
Full build log: https://ci.FreeBSD.org/job/FreeBSD-main-amd64-test/29654/console
Status explanation:
"Unstable" - some tests are suspected being broken by the following changes
"Still Unstable" - the failing test cases have not been fixed by these
following changes and this is a notification to note that
these changes have not been fully tested by the CI system
Change summaries:
(Those commits are likely but not certainly responsible)
6b1d5fec57f9604a447864ec5e66940126b38df4 by markj:
netipsec: Fix V_spd_size updates
5bf78497dc3ad24197e4940c91ab7c06230af86b by markj:
socket: Remove the divert(4) socket compat shim again
ba9a5169d16556d682d03989e15574ed346db092 by gordon:
openssl: build libcrypto and libssl from upstream's source set
cb3d3e5bb0c6bbb1f6ef3efe67e7a6e71bc20f0b by gordon:
openssl: configure with --openssldir=/etc/ssl
The failed test cases:
9 tests failed.
FAILED: sys.netinet6.ndp.ndp_prefix_lifetime
Error Message:
atf-check failed; see the output of the test for details
FAILED: sys.netpfil.pf.syncookie.basic_v6
Error Message:
Failed to connect to syncookie protected echo daemon
FAILED: sys.kern.ssl_sendfile.eagain_vs_eof
Error Message:
/usr/src/tests/sys/kern/ssl_sendfile.c:485: c.sbytes == -1 not met
FAILED: sys.kern.ssl_sendfile.grow
Error Message:
Test case body timed out
FAILED: sys.kern.ssl_sendfile.truncate
Error Message:
Test case body timed out
FAILED: lib.libexecinfo.sigtramp_test.test_backtrace_sigtramp
Error Message:
/usr/src/lib/libexecinfo/tests/sigtramp_test.c:30: n > 1 not met
FAILED: sys.net.if_lagg_test.witness
Error Message:
Lock-order reversals involving if_lagg.c detected
FAILED: sys.netinet.udp_bindings.connect_bound_socket_from_2address_jail
Error Message:
/usr/src/tests/sys/netinet/udp_bindings.c:244: connect(s, (struct sockaddr *)&sin, sizeof(sin)) == 0 not met
FAILED: sys.netlink.netlink_socket.overflow
Error Message:
/usr/src/tests/sys/netlink/netlink_socket.c:146: send(fd, &hdr, sizeof(hdr), 0) == sizeof(hdr) not met