FreeBSD-main-amd64-test - Build #29652 - Still Unstable

From: <jenkins-admin_at_FreeBSD.org>
Date: Fri, 09 Oct 2026 06:37:12 UTC
FreeBSD-main-amd64-test - Build #29652 (398b29f07f7d1fa6a045b3ccf242a55cb61207c0) - Still Unstable

Build information: https://ci.FreeBSD.org/job/FreeBSD-main-amd64-test/29652/
Full change log: https://ci.FreeBSD.org/job/FreeBSD-main-amd64-test/29652/changes
Full build log: https://ci.FreeBSD.org/job/FreeBSD-main-amd64-test/29652/console

Status explanation:
"Unstable" - some tests are suspected being broken by the following changes
"Still Unstable" - the failing test cases have not been fixed by these
                   following changes and this is a notification to note that
                   these changes have not been fully tested by the CI system

Change summaries:
(Those commits are likely but not certainly responsible)

439eb9c9771b8a62b5bcc8d2f7337f26c4d717e2 by dteske:
sysconf: accept a unique prefix of a target keyword

398b29f07f7d1fa6a045b3ccf242a55cb61207c0 by dteske:
sysconf: add a poudriere target



The failed test cases:

8 tests failed.
FAILED:  sys.netpfil.pf.syncookie.basic_v6

Error Message:
Failed to connect to syncookie protected echo daemon

FAILED:  sys.kern.ssl_sendfile.eagain_vs_eof

Error Message:
/usr/src/tests/sys/kern/ssl_sendfile.c:485: c.sbytes == -1 not met

FAILED:  sys.kern.ssl_sendfile.grow

Error Message:
Test case body timed out

FAILED:  sys.kern.ssl_sendfile.truncate

Error Message:
Test case body timed out

FAILED:  lib.libexecinfo.sigtramp_test.test_backtrace_sigtramp

Error Message:
/usr/src/lib/libexecinfo/tests/sigtramp_test.c:30: n > 1 not met

FAILED:  sys.net.if_lagg_test.witness

Error Message:
Lock-order reversals involving if_lagg.c detected

FAILED:  sys.netinet.udp_bindings.connect_bound_socket_from_2address_jail

Error Message:
/usr/src/tests/sys/netinet/udp_bindings.c:244: connect(s, (struct sockaddr *)&sin, sizeof(sin)) == 0 not met

FAILED:  sys.netlink.netlink_socket.overflow

Error Message:
/usr/src/tests/sys/netlink/netlink_socket.c:146: send(fd, &hdr, sizeof(hdr), 0) == sizeof(hdr) not met