FreeBSD-stable-15-amd64-test - Build #1154 - Still Unstable

From: <jenkins-admin_at_FreeBSD.org>
Date: Thu, 08 Oct 2026 18:28:31 UTC
FreeBSD-stable-15-amd64-test - Build #1154 (12e25072a868d039f08509d39a40be3b714d3638) - Still Unstable

Build information: https://ci.FreeBSD.org/job/FreeBSD-stable-15-amd64-test/1154/
Full change log: https://ci.FreeBSD.org/job/FreeBSD-stable-15-amd64-test/1154/changes
Full build log: https://ci.FreeBSD.org/job/FreeBSD-stable-15-amd64-test/1154/console

Status explanation:
"Unstable" - some tests are suspected being broken by the following changes
"Still Unstable" - the failing test cases have not been fixed by these
                   following changes and this is a notification to note that
                   these changes have not been fully tested by the CI system

Change summaries:
(Those commits are likely but not certainly responsible)

12e25072a868d039f08509d39a40be3b714d3638 by pouria:
route/fib_algo: Fix FIB_ALGO without ROUTE_MPATH option



The failed test cases:

3 tests failed.
FAILED:  sys.netpfil.pf.pfsync.bulk

Error Message:
state not found on synced host

FAILED:  sys.net.if_wg.wg_basic_crossaf

Error Message:
atf-check failed; see the output of the test for details

FAILED:  lib.libexecinfo.sigtramp_test.test_backtrace_sigtramp

Error Message:
/usr/src/lib/libexecinfo/tests/sigtramp_test.c:30: n > 1 not met