FreeBSD-main-amd64-test - Build #29644 - Still Unstable

From: <jenkins-admin_at_FreeBSD.org>
Date: Thu, 08 Oct 2026 08:12:43 UTC
FreeBSD-main-amd64-test - Build #29644 (bf97446e34abfe096d91d8c2bd49ea9a50d2227d) - Still Unstable

Build information: https://ci.FreeBSD.org/job/FreeBSD-main-amd64-test/29644/
Full change log: https://ci.FreeBSD.org/job/FreeBSD-main-amd64-test/29644/changes
Full build log: https://ci.FreeBSD.org/job/FreeBSD-main-amd64-test/29644/console

Status explanation:
"Unstable" - some tests are suspected being broken by the following changes
"Still Unstable" - the failing test cases have not been fixed by these
                   following changes and this is a notification to note that
                   these changes have not been fully tested by the CI system

Change summaries:
(Those commits are likely but not certainly responsible)

5cb96993447fc7bd26aba808fd6961652effa4bc by ngie:
kyua: import kyua-0.15.0-beta1

f6ae5b18a6ed3fd628c48723e608fa3a9f5b1906 by ngie:
kyua: import kyua-0.15.0-rc1

47275d8e3be892284883433ae1a74040f6e85b7f by ngie:
kyua: import kyua-0.15.0-rc2

5c20c75b67e3c96d58c1bbfe82472a8371bfa161 by markj:
epair: Make vnet_epair_uninit() run earlier

a23901a37be9d8567db42f20d2ccc40fc5b7ee2a by markj:
linux: Initialize per-VNET state earlier

d45b063c06d46d0f43489708e226821cddbad53b by markj:
gve: fix kernel panic on attach failure

67f85bf4b3f1156f2300fb6414f6bb0ca446c436 by markj:
gve: fix double free on ring allocation failure

a1789e345db7f7c5f248006b49bb287067e03a45 by bapt:
dhclient: recognize the Captive Portal DHCP options

afee6fb209d18209f5b7707b944b30b80051e193 by bapt:
dhclient: request the Captive Portal options

7ba72855939fc53eb8b6d9def386564579780786 by bapt:
dhclient: export the Captive Portal URI to the script

0f1ca95d7740e0800572ed436fd61e70f76eb6c3 by bapt:
dhclient-script: store the Captive Portal URI

7dd9a8125f70f1fc40fd9907bdaae0d23c8586c9 by alc:
arm64: a local TLB invalidation suffices when enabling write access

b6a573aa771e4a4b239a7bfeb074d1d25e811c1b by 0mp:
dwatch(1): Use mdo(1) instead of sudo(8) when configured

3ba592cfea1a5625024a0974fa5268f2e0c8f808 by emaste:
makefs: Correct style(9) nit from a recent change

c2ac0db7150c53d3902dbe1c507d96cbacfcadc6 by markj:
devfs: Explicitly disable inotify

fa6fe034a73c8b17320d1e68767ad2aa99eaa8bf by markj:
inotify.2: Add some entries to the BUGS section

dece5b05f577fc4c6b89af7ad48dfbdf7cc4945c by rcm:
makefs/zfs: Allow the autotrim pool property to be set

e7b019fbf1a0f02386a8d02eac4a691f112cc242 by fernape:
whereis: Fix list size calculation.

26203cca52621c215f60640bf59128dcd9780be7 by christos:
rc.d/mountd: Do not require /etc/exports

1d21e67e720a08992e81d626cff9d76524a81f22 by aokblast:
libthr: Do not rely on UB in counter

627e7d5b72cf967eae3cd9e9e0707ce0ff63a4da by aokblast:
libthr: reject count < 0

ccd44c5e4881ece004fa23d3b479d4ee57b2a58e by kib:
vn_open_cred(): rename VN_OPEN_NAMECACHE flag to VN_OPEN_COREDUMP

bea382f25b16fec0e9a1c2be130935e739075287 by kib:
kern/coredump_vnode.c: avoid dumping to the mount point we suspended

99edcc3bd52614c6cf972ea8424a7807ed3fe1e3 by aokblast:
libthr: Reorder pthread mutex to prevent false sharing

78ae174e420a2eaa340b41247a260bc067fae0c6 by kib:
mlx5: support DevX UMEM page size bitmap

de2c0f157a9cce0b763da9ae97ada870fa4d1824 by aokblast:
libthr: Fix some bugs in trylock

144afd05f8a2300361ec30c1c2020e4022ddd943 by ngie:
kyua: import kyua-0.15.0

b836604e126d5b3d0d3dee5da6c4168d3ec43fea by ngie:
contrib/kyua: commit Makefile changes for version update

26eb328b52c3ec0ff79c8914b1993dfad03a0a7d by ngie:
contrib/kyua: commit generated files

ef947bb97302d8862545cd0a5f38b24fa1bae2f6 by ngie:
LinuxKPI: firmware: remove `enoentok` logic in `*firmware_request(..)`

6c305c3c3129c4b90d22fdea5092788549bf7992 by bapt:
dhclient-script(8): s/URI/URL

78887369c47fda5707ef72ef46a1c903df5b7cae by kevans:
loader.efi: devinit() just after parsing args instead

bf97446e34abfe096d91d8c2bd49ea9a50d2227d by rpokala:
ipmi(4): improve debugging for ioctl(IPMICTL_SEND_COMMAND)



The failed test cases:

9 tests failed.
FAILED:  sys.netpfil.pf.syncookie.basic_v6

Error Message:
Failed to connect to syncookie protected echo daemon

FAILED:  sys.netpfil.pf.pfsync.bulk

Error Message:
state not found on synced host

FAILED:  sys.kern.ssl_sendfile.eagain_vs_eof

Error Message:
/usr/src/tests/sys/kern/ssl_sendfile.c:485: c.sbytes == -1 not met

FAILED:  sys.kern.ssl_sendfile.grow

Error Message:
Test case body timed out

FAILED:  sys.kern.ssl_sendfile.truncate

Error Message:
Test case body timed out

FAILED:  lib.libexecinfo.sigtramp_test.test_backtrace_sigtramp

Error Message:
/usr/src/lib/libexecinfo/tests/sigtramp_test.c:30: n > 1 not met

FAILED:  sys.net.if_lagg_test.witness

Error Message:
Lock-order reversals involving if_lagg.c detected

FAILED:  sys.netinet.udp_bindings.connect_bound_socket_from_2address_jail

Error Message:
/usr/src/tests/sys/netinet/udp_bindings.c:244: connect(s, (struct sockaddr *)&sin, sizeof(sin)) == 0 not met

FAILED:  sys.netlink.netlink_socket.overflow

Error Message:
/usr/src/tests/sys/netlink/netlink_socket.c:146: send(fd, &hdr, sizeof(hdr), 0) == sizeof(hdr) not met