FreeBSD-main-amd64-test - Build #29639 - Still Unstable
Date: Wed, 07 Oct 2026 13:16:13 UTC
FreeBSD-main-amd64-test - Build #29639 (77a7a48a1cb003831ff1d4342b1974fc7f79381e) - Still Unstable
Build information: https://ci.FreeBSD.org/job/FreeBSD-main-amd64-test/29639/
Full change log: https://ci.FreeBSD.org/job/FreeBSD-main-amd64-test/29639/changes
Full build log: https://ci.FreeBSD.org/job/FreeBSD-main-amd64-test/29639/console
Status explanation:
"Unstable" - some tests are suspected being broken by the following changes
"Still Unstable" - the failing test cases have not been fixed by these
following changes and this is a notification to note that
these changes have not been fully tested by the CI system
Change summaries:
(Those commits are likely but not certainly responsible)
91970165e3bd028c8227a89b5adaafff8c68f800 by philip:
Vendor import of expat 2.9.0
4445d039583a0a47fc335e0d34401581bcbc104e by novel:
stand: userboot: improve userdisk error handling
274236ed084a259a0e8a11df1afebd2f2f1fb097 by kib:
rtld.c: avoid double-free on dso load failure in do_load_object()
572cd669d6997b759084191007f3744a3610b529 by mhorne:
hwpmc: handle delayed IBS NMIs on Zen 6
3e01ebda68291db307a5e6c23d4995c638be9228 by br:
riscv: support the new "riscv,isa-extensions" string-array.
e3f5a83b8f3c75651c1acb93c7f0edb8172b5eaa by emaste:
camcontrol: Add Spectra Logic copyright
0040d1fb7a251daa0690f4858ddb495bee79ae52 by imp:
cam: Rename cam_iosched_bio_complete to cam_iosched_bio_update_stats
4a3a5de8ace3c41da35f0fbac4d2549b868d1091 by imp:
nda: Update trim stats with the periph lock held
bd86f0508e461526ba7342e52bd9778394b183f7 by imp:
da: Update trim stats with the periph lock held
7845cf8de8db3f6dd60a69379907b51b80123eae by imp:
ada: Update trim stats for every bio
ab7249c288a4d7d09c88f4de705b58a2afbf35f9 by imp:
cam: Assert we have the periph lock when updating the iosched stats
9af3990ba7940e85c31b5fc074e9510ee195465f by olivier:
sem test: avoid ETIMEDOUT races in the EINTR test cases
657c089950a0388811c7ba3f6d3e7127c297864e by philip:
lib80211: fix build with eXpat 2.9.0
192781bf5d047cceff3a1947bfc754c8b5eb0835 by aokblast:
libthr: Consume error in check_and_init_mutex
77a7a48a1cb003831ff1d4342b1974fc7f79381e by rmacklem:
nfscl: Fix oddball cases for session slot release
The failed test cases:
10 tests failed.
FAILED: sys.kern.ssl_sendfile.eagain_vs_eof
Error Message:
/usr/src/tests/sys/kern/ssl_sendfile.c:485: c.sbytes == -1 not met
FAILED: sys.netinet6.ndp.ndp_del_gu_success
Error Message:
atf-check failed; see the output of the test for details
FAILED: sys.netpfil.pf.syncookie.basic_v6
Error Message:
Failed to connect to syncookie protected echo daemon
FAILED: sys.netpfil.pf.pfsync.bulk
Error Message:
state not found on synced host
FAILED: sys.kern.ssl_sendfile.grow
Error Message:
Test case body timed out
FAILED: sys.kern.ssl_sendfile.truncate
Error Message:
Test case body timed out
FAILED: lib.libexecinfo.sigtramp_test.test_backtrace_sigtramp
Error Message:
/usr/src/lib/libexecinfo/tests/sigtramp_test.c:30: n > 1 not met
FAILED: sys.net.if_lagg_test.witness
Error Message:
Lock-order reversals involving if_lagg.c detected
FAILED: sys.netinet.udp_bindings.connect_bound_socket_from_2address_jail
Error Message:
/usr/src/tests/sys/netinet/udp_bindings.c:244: connect(s, (struct sockaddr *)&sin, sizeof(sin)) == 0 not met
FAILED: sys.netlink.netlink_socket.overflow
Error Message:
/usr/src/tests/sys/netlink/netlink_socket.c:146: send(fd, &hdr, sizeof(hdr), 0) == sizeof(hdr) not met