FreeBSD-stable-15-amd64-test - Build #1149 - Still Unstable

From: <jenkins-admin_at_FreeBSD.org>
Date: Wed, 07 Oct 2026 07:18:23 UTC
FreeBSD-stable-15-amd64-test - Build #1149 (9a0ea129a2a6325d8422a30f9f22fba825c0abf1) - Still Unstable

Build information: https://ci.FreeBSD.org/job/FreeBSD-stable-15-amd64-test/1149/
Full change log: https://ci.FreeBSD.org/job/FreeBSD-stable-15-amd64-test/1149/changes
Full build log: https://ci.FreeBSD.org/job/FreeBSD-stable-15-amd64-test/1149/console

Status explanation:
"Unstable" - some tests are suspected being broken by the following changes
"Still Unstable" - the failing test cases have not been fixed by these
                   following changes and this is a notification to note that
                   these changes have not been fully tested by the CI system

Change summaries:
(Those commits are likely but not certainly responsible)

afc8c5f9fd73badc16d8312d86ecfd88ad01be01 by dim:
Merge commit 80e8c0a59189 from llvm-project (by ShengYi Hung):

8b754816e8032ceac791a9cfd5b6b9f589d81755 by dim:
llvm: add LoongArch target support, not enabled by default

0c409a56237ae09be7ba491750bbbbdb25ef2e4d by dim:
Merge commit c4ce37507537 from llvm-project (by ShengYi Hung):

2da109690be8f29f03b68150c827f47db81ad8b5 by maxim:
dummynet: do not overflow the points[ED_MAX_SAMPLES_NO] array

0154a0df90c736d0c6d246b31f92c7becf71a86a by maxim:
bsnmpget: initialise the suboption value in getsubopt1()

de5689d1e6ea621249e1ef44db3c2d3ee8431ba5 by maxim:
bsnmp: validate the lower bound of error_index in responses

7c5caf70b6e9ec9de608480b841fb1d091f1d3ff by mhorne:
libpmc: Query hwpmc for caps

04aa36c01c68c3ba93cdcb62f1f13f05b9b96da7 by mhorne:
pmc.h: bump PMC_VERSION_MINOR

fabb224f2f15b80eff4526d6e6b8c1c69834883e by emaste:
camcontrol: Add support for firmware uploading on HPE-branded drives

3b4437e9c9df13612b9958144dbb7a77ed22a258 by kp:
pf: set the correct type for rule timeouts

ad3fdab6e507e4ef73b705c86930846859cb41af by kib:
stat(2): report mount points using st_bsdflags SFBSD_MNTPOINT flag

2961d9d2f32ee59ae4a563362b18b8e9f073c8b1 by kib:
stat(2): Document st_bsdflags and SFBSD_NAMEDATTR

9a0ea129a2a6325d8422a30f9f22fba825c0abf1 by kib:
stat.2: document SFBSD_MNTROOT



The failed test cases:

5 tests failed.
FAILED:  sys.fs.fusefs.ext2-misc.execute

Error Message:
atf-check failed; see the output of the test for details

FAILED:  sys.kqueue.libkqueue.kqueue_test.main

Error Message:
Returned non-success exit status 1

FAILED:  sys.netpfil.pf.pfsync.bulk

Error Message:
state not found on synced host

FAILED:  sys.net.if_wg.wg_basic_crossaf

Error Message:
atf-check failed; see the output of the test for details

FAILED:  lib.libexecinfo.sigtramp_test.test_backtrace_sigtramp

Error Message:
/usr/src/lib/libexecinfo/tests/sigtramp_test.c:30: n > 1 not met