FreeBSD-stable-15-amd64-test - Build #1146 - Still Unstable

From: <jenkins-admin_at_FreeBSD.org>
Date: Tue, 06 Oct 2026 04:33:15 UTC
FreeBSD-stable-15-amd64-test - Build #1146 (41c078cae365b4ec6f61d9fe40dcb772bff796ba) - Still Unstable

Build information: https://ci.FreeBSD.org/job/FreeBSD-stable-15-amd64-test/1146/
Full change log: https://ci.FreeBSD.org/job/FreeBSD-stable-15-amd64-test/1146/changes
Full build log: https://ci.FreeBSD.org/job/FreeBSD-stable-15-amd64-test/1146/console

Status explanation:
"Unstable" - some tests are suspected being broken by the following changes
"Still Unstable" - the failing test cases have not been fixed by these
                   following changes and this is a notification to note that
                   these changes have not been fully tested by the CI system

Change summaries:
(Those commits are likely but not certainly responsible)

14d6926293569048d2d04f6e5a13d80f192ad99e by emaste:
openssh: Add reference for another local patch

2ba5b9da2be10261c383035bef932cd37d52f903 by emaste:
openssh: Add date bump command to FREEBSD-upgrade instructions

687a0d4a6b2391cd045951e4e431dd585d131575 by emaste:
OpenSSH: Update to 10.1p1

2bdbd0a3702fb9595767379a68861dd401c28621 by emaste:
OpenSSH: Update to 10.2p1

e1e83fddfb4e046626250229c31dea547f5583ee by emaste:
OpenSSH: Update to 10.3p1

f2b0910a9831d09404558611d20364456549a96f by emaste:
OpenSSH: Update to 10.4p1

128e91e002d29ecfb62f0568dda316eac4125b68 by arrowd:
nuageinit: Allow the userdata script to run before firstboot* rc

98cd53be408d3118004a254449d943bfb8a7f25c by vexeduxr:
stand/images: remove translucent pixels around orb

41c078cae365b4ec6f61d9fe40dcb772bff796ba by emaste:
pam_ssh: Fix build - chase OpenSSH function signature change



The failed test cases:

5 tests failed.
FAILED:  sys.net.if_wg.wg_basic_crossaf

Error Message:
atf-check failed; see the output of the test for details

FAILED:  sys.pmc.pmc_api_test.another_owners_id

Error Message:
1 checks failed; see output for more details

FAILED:  sys.pmc.pmc_api_test.never_allocated_id

Error Message:
3 checks failed; see output for more details

FAILED:  sys.pmc.pmc_api_test.released_id

Error Message:
1 checks failed; see output for more details

FAILED:  lib.libexecinfo.sigtramp_test.test_backtrace_sigtramp

Error Message:
/usr/src/lib/libexecinfo/tests/sigtramp_test.c:30: n > 1 not met