FreeBSD-main-amd64-test - Build #29625 - Still Unstable
Date: Tue, 06 Oct 2026 00:02:55 UTC
FreeBSD-main-amd64-test - Build #29625 (4a0ec469934a5de60b9b540689703a698ac44105) - Still Unstable
Build information: https://ci.FreeBSD.org/job/FreeBSD-main-amd64-test/29625/
Full change log: https://ci.FreeBSD.org/job/FreeBSD-main-amd64-test/29625/changes
Full build log: https://ci.FreeBSD.org/job/FreeBSD-main-amd64-test/29625/console
Status explanation:
"Unstable" - some tests are suspected being broken by the following changes
"Still Unstable" - the failing test cases have not been fixed by these
following changes and this is a notification to note that
these changes have not been fully tested by the CI system
Change summaries:
(Those commits are likely but not certainly responsible)
68386f6b551e64c956c9623b9973be9e462ce1de by rcm:
igc: Fix the flow control sysctl
fdd3f6f78888b02a1bfa69a0572317413dc14a45 by siva:
bsd.lib.mk: only ctfmerge if objfiles have a CTF section
412c3a0370491c6745e056266f54ce9aa67017e1 by andrew:
arm64/gicv5: Use ArmMpidr to find the correct CPU
16c787fbabb8077df1af3bd3baaddf3b4c0dd8e8 by gallatin:
arm64: Elide coherent busdma maps
4a0ec469934a5de60b9b540689703a698ac44105 by rcm:
iflib: Do not ring the transmit doorbell when nothing is pending
The failed test cases:
7 tests failed.
FAILED: sys.kern.ssl_sendfile.eagain_vs_eof
Error Message:
/usr/src/tests/sys/kern/ssl_sendfile.c:485: c.sbytes == -1 not met
FAILED: sys.kern.ssl_sendfile.grow
Error Message:
Test case body timed out
FAILED: sys.kern.ssl_sendfile.truncate
Error Message:
Test case body timed out
FAILED: lib.libexecinfo.sigtramp_test.test_backtrace_sigtramp
Error Message:
/usr/src/lib/libexecinfo/tests/sigtramp_test.c:30: n > 1 not met
FAILED: sys.net.if_lagg_test.witness
Error Message:
Lock-order reversals involving if_lagg.c detected
FAILED: sys.netinet.udp_bindings.connect_bound_socket_from_2address_jail
Error Message:
/usr/src/tests/sys/netinet/udp_bindings.c:244: connect(s, (struct sockaddr *)&sin, sizeof(sin)) == 0 not met
FAILED: sys.netlink.netlink_socket.overflow
Error Message:
/usr/src/tests/sys/netlink/netlink_socket.c:146: send(fd, &hdr, sizeof(hdr), 0) == sizeof(hdr) not met