FreeBSD-stable-14-amd64-test - Build #2184 - Still Unstable
Date: Mon, 05 Oct 2026 22:43:48 UTC
FreeBSD-stable-14-amd64-test - Build #2184 (2192d42bbcde78de89177994889481ae6d334f6e) - Still Unstable
Build information: https://ci.FreeBSD.org/job/FreeBSD-stable-14-amd64-test/2184/
Full change log: https://ci.FreeBSD.org/job/FreeBSD-stable-14-amd64-test/2184/changes
Full build log: https://ci.FreeBSD.org/job/FreeBSD-stable-14-amd64-test/2184/console
Status explanation:
"Unstable" - some tests are suspected being broken by the following changes
"Still Unstable" - the failing test cases have not been fixed by these
following changes and this is a notification to note that
these changes have not been fully tested by the CI system
Change summaries:
(Those commits are likely but not certainly responsible)
2192d42bbcde78de89177994889481ae6d334f6e by vexeduxr:
stand/images: remove translucent pixels around orb
The failed test cases:
4 tests failed.
FAILED: sys.netpfil.pf.pfsync.bulk
Error Message:
state not found on synced host
FAILED: sys.pmc.pmc_api_test.another_owners_id
Error Message:
1 checks failed; see output for more details
FAILED: sys.pmc.pmc_api_test.never_allocated_id
Error Message:
3 checks failed; see output for more details
FAILED: sys.pmc.pmc_api_test.released_id
Error Message:
1 checks failed; see output for more details