FreeBSD-main-amd64-test - Build #29622 - Still Unstable

From: <jenkins-admin_at_FreeBSD.org>
Date: Mon, 05 Oct 2026 15:54:34 UTC
FreeBSD-main-amd64-test - Build #29622 (d7e7397c217137c9f2465f60a7faf129c87934ec) - Still Unstable

Build information: https://ci.FreeBSD.org/job/FreeBSD-main-amd64-test/29622/
Full change log: https://ci.FreeBSD.org/job/FreeBSD-main-amd64-test/29622/changes
Full build log: https://ci.FreeBSD.org/job/FreeBSD-main-amd64-test/29622/console

Status explanation:
"Unstable" - some tests are suspected being broken by the following changes
"Still Unstable" - the failing test cases have not been fixed by these
                   following changes and this is a notification to note that
                   these changes have not been fully tested by the CI system

Change summaries:
(Those commits are likely but not certainly responsible)

49bec8c3dc58cf8e944f9bbbbea07e7e856ad897 by rmacklem:
clnt_vc.c: Fix handling of broken TCP connections

a52c50b4b7c2652954ef1bd34710a4b1fc8ef391 by rmacklem:
nfs_nfsdstate.c: Add an extra safety belt check for the backchannel

d7e7397c217137c9f2465f60a7faf129c87934ec by emaste:
LinuxKPI: Add crc16.h for amdkfd support



The failed test cases:

11 tests failed.
FAILED:  sys.net.if_geneve.ether_ipv6_blind_options

Error Message:
atf-check failed; see the output of the test for details

FAILED:  sys.netpfil.pf.pflog.rdr_action

Error Message:
atf-check failed; see the output of the test for details

FAILED:  sys.netpfil.pf.syncookie.basic_v6

Error Message:
Failed to connect to syncookie protected echo daemon

FAILED:  sys.netpfil.pf.pfsync.bulk

Error Message:
state not found on synced host

FAILED:  sys.kern.ssl_sendfile.eagain_vs_eof

Error Message:
/usr/src/tests/sys/kern/ssl_sendfile.c:485: c.sbytes == -1 not met

FAILED:  sys.kern.ssl_sendfile.grow

Error Message:
Test case body timed out

FAILED:  sys.kern.ssl_sendfile.truncate

Error Message:
Test case body timed out

FAILED:  lib.libexecinfo.sigtramp_test.test_backtrace_sigtramp

Error Message:
/usr/src/lib/libexecinfo/tests/sigtramp_test.c:30: n > 1 not met

FAILED:  sys.net.if_lagg_test.witness

Error Message:
Lock-order reversals involving if_lagg.c detected

FAILED:  sys.netinet.udp_bindings.connect_bound_socket_from_2address_jail

Error Message:
/usr/src/tests/sys/netinet/udp_bindings.c:244: connect(s, (struct sockaddr *)&sin, sizeof(sin)) == 0 not met

FAILED:  sys.netlink.netlink_socket.overflow

Error Message:
/usr/src/tests/sys/netlink/netlink_socket.c:146: send(fd, &hdr, sizeof(hdr), 0) == sizeof(hdr) not met