FreeBSD-main-amd64-test - Build #29618 - Still Unstable

From: <jenkins-admin_at_FreeBSD.org>
Date: Sun, 04 Oct 2026 21:09:32 UTC
FreeBSD-main-amd64-test - Build #29618 (e8a7efd92181720e9d7a7ef50fe3a00294911027) - Still Unstable

Build information: https://ci.FreeBSD.org/job/FreeBSD-main-amd64-test/29618/
Full change log: https://ci.FreeBSD.org/job/FreeBSD-main-amd64-test/29618/changes
Full build log: https://ci.FreeBSD.org/job/FreeBSD-main-amd64-test/29618/console

Status explanation:
"Unstable" - some tests are suspected being broken by the following changes
"Still Unstable" - the failing test cases have not been fixed by these
                   following changes and this is a notification to note that
                   these changes have not been fully tested by the CI system

Change summaries:
(Those commits are likely but not certainly responsible)

22f50379ab93024354e98333250d453a6d0eaff5 by seuros:
nvme: delete the I/O queues in the system shutdown path

0a0490ed551d8c89aca16b6b2f1a3b3681b60972 by seuros:
nvme: do not complete a command when its Abort is not performed

e8a7efd92181720e9d7a7ef50fe3a00294911027 by seuros:
nvme: set the controller Timestamp feature



The failed test cases:

8 tests failed.
FAILED:  sys.netpfil.pf.pfsync.bulk

Error Message:
state not found on synced host

FAILED:  sys.kern.ssl_sendfile.eagain_vs_eof

Error Message:
/usr/src/tests/sys/kern/ssl_sendfile.c:485: c.sbytes == -1 not met

FAILED:  sys.kern.ssl_sendfile.grow

Error Message:
Test case body timed out

FAILED:  sys.kern.ssl_sendfile.truncate

Error Message:
Test case body timed out

FAILED:  lib.libexecinfo.sigtramp_test.test_backtrace_sigtramp

Error Message:
/usr/src/lib/libexecinfo/tests/sigtramp_test.c:30: n > 1 not met

FAILED:  sys.net.if_lagg_test.witness

Error Message:
Lock-order reversals involving if_lagg.c detected

FAILED:  sys.netinet.udp_bindings.connect_bound_socket_from_2address_jail

Error Message:
/usr/src/tests/sys/netinet/udp_bindings.c:244: connect(s, (struct sockaddr *)&sin, sizeof(sin)) == 0 not met

FAILED:  sys.netlink.netlink_socket.overflow

Error Message:
/usr/src/tests/sys/netlink/netlink_socket.c:146: send(fd, &hdr, sizeof(hdr), 0) == sizeof(hdr) not met