FreeBSD-main-amd64-test - Build #29613 - Still Unstable
Date: Sun, 04 Oct 2026 06:25:17 UTC
FreeBSD-main-amd64-test - Build #29613 (2050abe804836cb79ced55ea983bb4edc993fa64) - Still Unstable
Build information: https://ci.FreeBSD.org/job/FreeBSD-main-amd64-test/29613/
Full change log: https://ci.FreeBSD.org/job/FreeBSD-main-amd64-test/29613/changes
Full build log: https://ci.FreeBSD.org/job/FreeBSD-main-amd64-test/29613/console
Status explanation:
"Unstable" - some tests are suspected being broken by the following changes
"Still Unstable" - the failing test cases have not been fixed by these
following changes and this is a notification to note that
these changes have not been fully tested by the CI system
Change summaries:
(Those commits are likely but not certainly responsible)
65840afc88553f89c051b96b081061a532cb7df3 by cperciva:
EC2: Pass --vmdk to bsdec2-image-upload if needed
34f2f57b836d9cec02130419f5272495860d4ddf by cperciva:
EC2: Use stream-optimized VMDK format
acbcb68c9f744dedc49835b8e235a0afa13f6c26 by imp:
stand: Remove const from zfs_lookup's zfsmount argument
ecd41c0df3a0e5f98716c5aabbdeb36c2c29b86f by imp:
stand: zfs_dnode_stat move from spa to mount argument
16cf795d3e0bf9cc605ea64564c8cfecae74ff76 by imp:
stand: zfs_dnode_readlink move from spa to mount argument
32fcc66dd311207451cd4916f9ed837ee19f9e07 by imp:
stand: Load dynamic system attribute offsets
4175fa107f77e93c7e5c7d0dbd3662b0a6ae620b by imp:
stand: Lookup the offsets for this SA bundle
8bc06ba211b962c4742fe2acb17c22b86256d592 by imp:
stand: Lookup specific SA value in a dnode
f382ef1dc82cf0679b164be1e6cce51c022a204c by imp:
stand: update zfs_dnode_stat to use zfs_dnode_sa_lookup
262fa4695d90207b9080f2cc5cb01eccf07fe243 by imp:
stand: Implement zfs_dnode_readlink in terms of zfs_dnode_sa_lookup
de0a279c8b6967ffd1cb0c9f76d3cc4658a0f1aa by bapt:
nuageinit: apply meta-data if user-data is a script
f12b76524d7bbf3d6c1a890834b6f8d018704ef0 by rcm:
callout: do not retry a try-lock callout sooner than a tick
c2089b654ad2568cdd5ddc7baa9ac47db7c3b00c by rmacklem:
nfscl: Add support for b_pages to be used by RDMA
2050abe804836cb79ced55ea983bb4edc993fa64 by rmacklem:
rpc_generic.c: Initialize "cp" to shut the compiler up
The failed test cases:
8 tests failed.
FAILED: sys.netpfil.pf.pfsync.bulk
Error Message:
state not found on synced host
FAILED: sys.kern.ssl_sendfile.eagain_vs_eof
Error Message:
/usr/src/tests/sys/kern/ssl_sendfile.c:485: c.sbytes == -1 not met
FAILED: sys.kern.ssl_sendfile.grow
Error Message:
Test case body timed out
FAILED: sys.kern.ssl_sendfile.truncate
Error Message:
Test case body timed out
FAILED: lib.libexecinfo.sigtramp_test.test_backtrace_sigtramp
Error Message:
/usr/src/lib/libexecinfo/tests/sigtramp_test.c:30: n > 1 not met
FAILED: sys.net.if_lagg_test.witness
Error Message:
Lock-order reversals involving if_lagg.c detected
FAILED: sys.netinet.udp_bindings.connect_bound_socket_from_2address_jail
Error Message:
/usr/src/tests/sys/netinet/udp_bindings.c:244: connect(s, (struct sockaddr *)&sin, sizeof(sin)) == 0 not met
FAILED: sys.netlink.netlink_socket.overflow
Error Message:
/usr/src/tests/sys/netlink/netlink_socket.c:146: send(fd, &hdr, sizeof(hdr), 0) == sizeof(hdr) not met