FreeBSD-stable-15-amd64-test - Build #1143 - Still Unstable
- In reply to: jenkins-admin_a_FreeBSD.org: "FreeBSD-stable-15-amd64-test - Build #1142 - Still Unstable"
- Go to: [ bottom of page ] [ top of archives ] [ this month ]
Date: Sat, 03 Oct 2026 18:31:31 UTC
FreeBSD-stable-15-amd64-test - Build #1143 (40f4174d62aa4c89730ec7adff1245a5626acd88) - Still Unstable
Build information: https://ci.FreeBSD.org/job/FreeBSD-stable-15-amd64-test/1143/
Full change log: https://ci.FreeBSD.org/job/FreeBSD-stable-15-amd64-test/1143/changes
Full build log: https://ci.FreeBSD.org/job/FreeBSD-stable-15-amd64-test/1143/console
Status explanation:
"Unstable" - some tests are suspected being broken by the following changes
"Still Unstable" - the failing test cases have not been fixed by these
following changes and this is a notification to note that
these changes have not been fully tested by the CI system
Change summaries:
(Those commits are likely but not certainly responsible)
64df13dae7fc7477b7209869211d2def931c8be9 by kfv:
libjail: Preserve const qualifier on strchr(3) and strrchr(3) results
9c184546d062a0cb6f70ddbb5f65f4adacaa8ad1 by kfv:
ps(1): Preserve const qualifier on strchr(3) result
536b344c40e21229dbe6e14f0dd4c6a0ed66c3a0 by kfv:
devmatch(8): Preserve const qualifier on strchr(3) and strstr(3) results
850a848197b2c34c9536070d0bbe238215bbeb1b by kfv:
dd(1): Preserve const qualifier on bsearch(3) results
a8fcc589292003b85fb49dc991df9715d99879ca by kfv:
ed(1): Preserve const qualifier on strchr(3) result
3b8ba87af29ef277c16003d1d1c299956e4e4bbc by kfv:
ls(1): Preserve const qualifier on strstr(3) result
ad60cb1085bc4074c33f52d40105e3e9c7381a9a by kfv:
pkg(7): Preserve const qualifier on strrchr(3) results
40f4174d62aa4c89730ec7adff1245a5626acd88 by kfv:
jail(8): Preserve const qualifier on strchr(3) results
The failed test cases:
6 tests failed.
FAILED: usr.bin.limits.limits_test.cputime_hard_flag
Error Message:
atf-check failed; see the output of the test for details
FAILED: sys.net.if_wg.wg_basic_crossaf
Error Message:
atf-check failed; see the output of the test for details
FAILED: sys.pmc.pmc_api_test.another_owners_id
Error Message:
1 checks failed; see output for more details
FAILED: sys.pmc.pmc_api_test.never_allocated_id
Error Message:
3 checks failed; see output for more details
FAILED: sys.pmc.pmc_api_test.released_id
Error Message:
1 checks failed; see output for more details
FAILED: lib.libexecinfo.sigtramp_test.test_backtrace_sigtramp
Error Message:
/usr/src/lib/libexecinfo/tests/sigtramp_test.c:30: n > 1 not met