FreeBSD-stable-15-amd64-test - Build #1141 - Still Unstable

From: <jenkins-admin_at_FreeBSD.org>
Date: Sat, 03 Oct 2026 09:54:04 UTC
FreeBSD-stable-15-amd64-test - Build #1141 (961a842fdd3a2e0868444d689acbe7349a55ebfa) - Still Unstable

Build information: https://ci.FreeBSD.org/job/FreeBSD-stable-15-amd64-test/1141/
Full change log: https://ci.FreeBSD.org/job/FreeBSD-stable-15-amd64-test/1141/changes
Full build log: https://ci.FreeBSD.org/job/FreeBSD-stable-15-amd64-test/1141/console

Status explanation:
"Unstable" - some tests are suspected being broken by the following changes
"Still Unstable" - the failing test cases have not been fixed by these
                   following changes and this is a notification to note that
                   these changes have not been fully tested by the CI system

Change summaries:
(Those commits are likely but not certainly responsible)

961a842fdd3a2e0868444d689acbe7349a55ebfa by philip:
contrib/tzdata: import tzdata 2026e



The failed test cases:

6 tests failed.
FAILED:  sys.net.if_wg.wg_basic_crossaf

Error Message:
atf-check failed; see the output of the test for details

FAILED:  sys.netpfil.pf.pfsync.bulk

Error Message:
state not found on synced host

FAILED:  sys.pmc.pmc_api_test.another_owners_id

Error Message:
1 checks failed; see output for more details

FAILED:  sys.pmc.pmc_api_test.never_allocated_id

Error Message:
3 checks failed; see output for more details

FAILED:  sys.pmc.pmc_api_test.released_id

Error Message:
1 checks failed; see output for more details

FAILED:  lib.libexecinfo.sigtramp_test.test_backtrace_sigtramp

Error Message:
/usr/src/lib/libexecinfo/tests/sigtramp_test.c:30: n > 1 not met