FreeBSD-main-amd64-test - Build #29602 - Still Unstable

From: <jenkins-admin_at_FreeBSD.org>
Date: Fri, 02 Oct 2026 06:25:36 UTC
FreeBSD-main-amd64-test - Build #29602 (6948f4d5e2b29100b986a96175ef9efb1ab91616) - Still Unstable

Build information: https://ci.FreeBSD.org/job/FreeBSD-main-amd64-test/29602/
Full change log: https://ci.FreeBSD.org/job/FreeBSD-main-amd64-test/29602/changes
Full build log: https://ci.FreeBSD.org/job/FreeBSD-main-amd64-test/29602/console

Status explanation:
"Unstable" - some tests are suspected being broken by the following changes
"Still Unstable" - the failing test cases have not been fixed by these
                   following changes and this is a notification to note that
                   these changes have not been fully tested by the CI system

Change summaries:
(Those commits are likely but not certainly responsible)

fc6ed8627222a625a700e99cdfcda19654a0c651 by mm:
zfs: cherry-pick from openzfs/master (restore reverted commit)

566fdcba48817b0f8fea1f9b2963505b925675fb by otis:
man: Link ena.4 to if_ena.4

2fa4ef491608aad827f8ceef3eb389d8c07451fb by rcm:
pf: free the packet rate counter of a rule

5c13a82de8be51c8472e922a667519d575dcb59e by rcm:
pf: remove a source limiter from the id tree if its name is taken

f05af59fba6912bdde8c911b0820871224ed16db by rcm:
pf: return per-address feedback from netlink table test

37c9eba1644b0f9e1b5d130ccff381122f48aebe by dim:
Merge commit 80e8c0a59189 from llvm-project (by ShengYi Hung):

2748019034f036e7c18b0dcd7713d972b6e45eed by markj:
tests/sys/vfs: Fix the Linux kld check

cdb4538d7f6ba891ad54dd7d3d1b25632410e40f by maxim:
tcpdrop.8: spell newreno

9279dd3c15fbbf82e5727bc7bdfbc8e8b5a53552 by maxim:
tcpdrop.8: Xr mod_cc(4)

a68d11d310dd5100a18f187c1108df6703315989 by sobomax:
stress2: Fix script bugs in gnop6.sh, gnop7.sh and fdatasync*.sh

9deffad27457adf505c53589c4f5d6eb1560c288 by np:
cxgbe(4): Use alternate credit compute mechanism in T7 LB modes

e2279d5ba9a91407239cba4bed80abff73b15798 by tuexen:
tcpdrop: improve handling of -C and -S

18ce3f50f630f64d5e9e898a3c06e9ed6e5a63a5 by olce:
random: Remove unused include of ifuncs

a2fbd988638e94b61cc78449e893f2c02d43dec0 by olce:
ifuncs: Include <machine/ifunc.h> instead of <x86/ifunc.h>

5f275e547814db5944ff1ca746c31447a0896e1e by np:
cxgbev(4): verify the vendor id before claiming a device

43b0384bc7e87df5bd164ce833617e68824f4828 by sobomax:
mountpoint(1): new utility, implemented as a stat(1) hardlink

f7663278c2ba527dc681b1a806d4cc78ea49452b by vexeduxr:
stand/images: remove translucent pixels around orb

f958aa7e754d88f3955f3c30a13f0e492822e3c3 by vexeduxr:
vt: Fix timer race between vtterm_splash() and vt_flush()

e65b7079db12afb1aa61be4f1c666b162984a95e by glebius:
tcp: use SB_AUTOSIZE flag to tell if socket buffer was set

6948f4d5e2b29100b986a96175ef9efb1ab91616 by glebius:
sendfile: keep the lowat hack more conservative



The failed test cases:

4 tests failed.
FAILED:  lib.libexecinfo.sigtramp_test.test_backtrace_sigtramp

Error Message:
/usr/src/lib/libexecinfo/tests/sigtramp_test.c:30: n > 1 not met

FAILED:  sys.net.if_lagg_test.witness

Error Message:
Lock-order reversals involving if_lagg.c detected

FAILED:  sys.netinet.udp_bindings.connect_bound_socket_from_2address_jail

Error Message:
/usr/src/tests/sys/netinet/udp_bindings.c:244: connect(s, (struct sockaddr *)&sin, sizeof(sin)) == 0 not met

FAILED:  sys.netlink.netlink_socket.overflow

Error Message:
/usr/src/tests/sys/netlink/netlink_socket.c:146: send(fd, &hdr, sizeof(hdr), 0) == sizeof(hdr) not met