FreeBSD-main-amd64-test - Build #29371 - Still Unstable
Date: Fri, 28 Aug 2026 06:07:47 UTC
FreeBSD-main-amd64-test - Build #29371 (8f0789bee7abb2fdb2ff6d625f254533a138e6e8) - Still Unstable
Build information: https://ci.FreeBSD.org/job/FreeBSD-main-amd64-test/29371/
Full change log: https://ci.FreeBSD.org/job/FreeBSD-main-amd64-test/29371/changes
Full build log: https://ci.FreeBSD.org/job/FreeBSD-main-amd64-test/29371/console
Status explanation:
"Unstable" - some tests are suspected being broken by the following changes
"Still Unstable" - the failing test cases have not been fixed by these
following changes and this is a notification to note that
these changes have not been fully tested by the CI system
Change summaries:
(Those commits are likely but not certainly responsible)
df537ff1520d82410328ebd6de529929dae620a6 by netchild:
hwpmc tests: sort the list of test programs
068957e040f40eb7f484b2530481f3eae02f9d44 by netchild:
hwpmc: add regression tests for a credential-changing exec
17fca802ded118102d04a7a0bbc0c076de18c4d8 by netchild:
hwpmc: add tests for handle validation and the privilege boundaries
d00da14532bc4408f3e66535c88276d00905af7c by netchild:
hwpmc tests: process-attachment lifecycle and ownership cases
bea7b932b9eeaff39393347e0600b982fd859a92 by netchild:
hwpmc: add credential-transition exec tests (keep and drop)
8f0789bee7abb2fdb2ff6d625f254533a138e6e8 by netchild:
hwpmc tests: the sampling log file
The failed test cases:
5 tests failed.
FAILED: sys.fs.fusefs.ext2-misc.execute
Error Message:
atf-check failed; see the output of the test for details
FAILED: sys.netpfil.pf.pfsync.bulk
Error Message:
state not found on synced host
FAILED: sys.netlink.netlink_socket.overflow
Error Message:
/usr/src/tests/sys/netlink/netlink_socket.c:146: send(fd, &hdr, sizeof(hdr), 0) == sizeof(hdr) not met
FAILED: lib.libarchive.functional_test.test_read_filter_lz4_raw_skip
Error Message:
atf-check failed; see the output of the test for details
FAILED: sys.netpfil.common.rdr.ipfnat_local_redirect
Error Message:
Redirect failed