FreeBSD-main-amd64-test - Build #29362 - Still Unstable

From: <jenkins-admin_at_FreeBSD.org>
Date: Thu, 27 Aug 2026 07:50:57 UTC
FreeBSD-main-amd64-test - Build #29362 (0f59df83869d3734a33d96b01381823e6a3ef3ff) - Still Unstable

Build information: https://ci.FreeBSD.org/job/FreeBSD-main-amd64-test/29362/
Full change log: https://ci.FreeBSD.org/job/FreeBSD-main-amd64-test/29362/changes
Full build log: https://ci.FreeBSD.org/job/FreeBSD-main-amd64-test/29362/console

Status explanation:
"Unstable" - some tests are suspected being broken by the following changes
"Still Unstable" - the failing test cases have not been fixed by these
                   following changes and this is a notification to note that
                   these changes have not been fully tested by the CI system

Change summaries:
(Those commits are likely but not certainly responsible)

4a20c0a9cd07b4fb9c864c1761a9b1707c6e675e by bdrewery:
sched_ule: Fix spelling of csr_cpu in comment.

0f59df83869d3734a33d96b01381823e6a3ef3ff by aokblast:
xhci: Only reset the data toggle value when the USB stack asks for it



The failed test cases:

3 tests failed.
FAILED:  sys.netpfil.pf.pfsync.bulk

Error Message:
state not found on synced host

FAILED:  lib.libarchive.functional_test.test_read_filter_lz4_raw_skip

Error Message:
atf-check failed; see the output of the test for details

FAILED:  sys.netpfil.common.rdr.ipfnat_local_redirect

Error Message:
Redirect failed