FreeBSD-main-amd64-test - Build #29357 - Still Unstable

From: <jenkins-admin_at_FreeBSD.org>
Date: Wed, 26 Aug 2026 20:04:04 UTC
FreeBSD-main-amd64-test - Build #29357 (f01b594b7fa5cac4328f7137fb9cb0eef7ffd040) - Still Unstable

Build information: https://ci.FreeBSD.org/job/FreeBSD-main-amd64-test/29357/
Full change log: https://ci.FreeBSD.org/job/FreeBSD-main-amd64-test/29357/changes
Full build log: https://ci.FreeBSD.org/job/FreeBSD-main-amd64-test/29357/console

Status explanation:
"Unstable" - some tests are suspected being broken by the following changes
"Still Unstable" - the failing test cases have not been fixed by these
                   following changes and this is a notification to note that
                   these changes have not been fully tested by the CI system

Change summaries:
(Those commits are likely but not certainly responsible)

f01b594b7fa5cac4328f7137fb9cb0eef7ffd040 by kevans:
snd_uaudio: recognize hardware sidetone as a monitor



The failed test cases:

4 tests failed.
FAILED:  sys.capsicum.functional.test_root

Error Message:
atf-check failed; see the output of the test for details

FAILED:  sys.netpfil.pf.pfsync.bulk

Error Message:
state not found on synced host

FAILED:  lib.libarchive.functional_test.test_read_filter_lz4_raw_skip

Error Message:
atf-check failed; see the output of the test for details

FAILED:  sys.netpfil.common.rdr.ipfnat_local_redirect

Error Message:
Redirect failed