FreeBSD-stable-14-amd64-test - Build #1449 - Still Unstable

From: <jenkins-admin_at_FreeBSD.org>
Date: Mon, 22 Sep 2025 06:57:11 UTC
FreeBSD-stable-14-amd64-test - Build #1449 (bd49a8db47dd3a825a48f4dcf1c8684675a502c2) - Still Unstable

Build information: https://ci.FreeBSD.org/job/FreeBSD-stable-14-amd64-test/1449/
Full change log: https://ci.FreeBSD.org/job/FreeBSD-stable-14-amd64-test/1449/changes
Full build log: https://ci.FreeBSD.org/job/FreeBSD-stable-14-amd64-test/1449/console

Status explanation:
"Unstable" - some tests are suspected being broken by the following changes
"Still Unstable" - the failing test cases have not been fixed by these
                   following changes and this is a notification to note that
                   these changes have not been fully tested by the CI system

Change summaries:
(Those commits are likely but not certainly responsible)

5367bef138862b21f937a66b5647f8f81e6f2ab7 by kib:
Revert "zfs readdir: if there were no dirents to copy out, return EINVAL

bd49a8db47dd3a825a48f4dcf1c8684675a502c2 by kib:
Revert "zfsctl_root_readdir: if there were no dirents to copy out,



The failed test cases:

3 tests failed.
FAILED:  sbin.ipfw.ipfw_test.__test_cases_list__

Error Message:
Unknown test case metadata property 'require.kmods'

FAILED:  sys.netinet.fibs_test.same_ip_multiple_ifaces_fib0

Error Message:
atf-check failed; see the output of the test for details

FAILED:  sys.netlink.test_netlink_message_writer.py.__test_cases_list__

Error Message:
Test program did not exit cleanly